{"text_format":"1","workbook":"xlsx","n_sheets":4,"sheets":["Instructions","Commitment Form","Contract Items","Data"],"not_rendered":{"charts":0,"images":0,"macros":1,"external_links":1,"defined_names":6,"comments":0,"pivot_tables":0},"unopened":[],"bounds":{"document_bytes":16777216,"sheet_cells":100000,"rows_first":2000,"rows_last":500,"rows_between":2000,"halvings":0,"cell_chars":16384,"cell_head_chars":4096},"cells_cut":0,"cells_raw":0,"read":"whole","date_system":"1900"}

{"sheet":"Instructions","index":0,"n_rows":31,"n_cols":1,"rows_kept":31,"cut":false,"hidden":false,"merged":[[11,0,11,26]]}
["Information/Instruction for Completion of CTDOT SBE or DBE Commitment Form rev. 8/2024"]
[" Disadvantaged Business Enterprise (ct.gov)"]
["Step 1 - Identify all SBE/DBE firms that will be used and get pricing/quotations prior to bid opening.  Complete the commitment form for each SBE/DBE firm being used for a SBE set-aside or DBE goal.  Tab 2 will be the project information including, Prime contractor information, SBE/DBE Firm information, contract amount, SBE set-aside or DBE goal, etc.  Tab 3 is the subcontractor item sheet in which all items subcontracted for SBE set-aside or DBE credit toward the DBE goal must be listed.  Please be sure to use the excel format provided and DO NOT hand write on these forms – they are calculated and formulated for DBE goal counting requirements to avoid mathematical errors.  For DBE submittals, please only use the one NAICS code that most closely matches the work being performed for that firm.  For each SBE or DBE submittal, a new form must be used."]
["* Please note that Prime contractors who are also certified DBE firms may use themselves to meet the goal but will still need to complete this form.  SBE Prime contractors are not allowed to use themselves when meeting the SBE set-aside.  This work must still be set aside for another current SBE certified firm."]
[]
["Step 2 – Complete the commitment form on the 2nd tab in its entirety including all backup documentation that is needed.  For SBE submittals this will include the completed commitment form, SBE certificate and SBE Exhibit 3.   For DBE submittals this will include the completed commitment form, DBE quote, and any explanations of partial items.  You are required to submit enough to meet either the SBE set-aside or the DBE goal.  Save this form as a PDF and submit to the Department within 5 days of bid opening along with the required attachments.  If you fail to submit enough to meet or exceed the SBE set-aside or DBE goal, please move on to Step 3."]
[]
["Step 3 – After exhausting all efforts to secure DBE firms in order to meet the goal, if you still are not successful in doing so please refer to the DBE/GFE package link below and follow instructions on how to prepare a full and complete GFE.  GFE packages are also due within the 5-day timeline from the bid opening and there will be no extensions given on filing these, should you not meet the goal.  "]
["https://portal.ct.gov/-/media/dot/documents/dcontracts/dbe-good-faith-effort-application-20-07-15.pdf"]
[]
["If you have any further questions or still require assistance please reach out to your contracts unit liaison."]
["“Commercial Useful Function (CUF)” A DBE performs a commercially useful function (CUF) when it is responsible for execution of the work of the contract and is carrying out its responsibilities by performing, managing, and supervising the work involved. To perform a commercially useful function, the DBE must also be responsible, with respect to materials and supplies used on the contract, for negotiating price, determining quality and quantity, ordering the material, and installing (where applicable) and paying for the material itself. To determine whether a DBE is performing a commercially useful function, you must evaluate the amount of work subcontracted, industry practices, whether the amount the firm is to be paid under the contract is commensurate with the work it is performing, and the DBE credit claimed for its performance of the work, and other relevant factors.  A DBE does not perform a commercially useful function if its role is limited to that of an extra participant in a transaction, contract, or project through which funds are passed to obtain the appearance of DBE participation. In determining whether a DBE is such an extra participant, you must examine similar transactions, particularly those in which DBEs do not participate."]
["Firm Type Codes"]
[]
["“S” Subcontracted or Partially Subcontracted Items: It is important when subcontracting out a line item either partial or full to make sure that the DBE firm is meeting the comercial useful function (CUF) of that item in order to obtain full DBE credit.  In the case of a partial item, please be sure it is designated for each item and that you provide a description or detail on who will be performing what work on the item and also who will be doing the other portion of the item, along with how the subcontractor is being paid for that item.  CTDOT units of measure do not always translate to how the subcontractor is paid out.  We will need to know how that partial item is being paid to the subcontractor regardless of how that item was bid.  Please be sure to designate these subcontracted items as “S”."]
[]
["“P” Supply Items: For supply items not provided by a manufacturer, the supplier is required to complete the regular dealer/distributor affirmation form.  The supplier is required to complete and submit this form.  This form will assist the contractor to determine the appropriate credit.  If you are subcontracting a DBE firm for supply items, they are allowed 60% credit on that supply item if they meet the CUF as a regular dealer.  New federal regulations have been put in place in regard to supply items and have added “distributor” as a new subset of DBE suppliers. (\"PD\" Firm Type Code) Distributors are permitted to drop-ship from manufacturers if the firm has a distributorship agreement or assumes all responsibility for the materials after point of origin, allowing 40% credit for the cost of materials. Packagers, brokers, manufacturers' representatives, or other persons who arrange, facilitate, or expedite transactions are not regular dealers or suppliers.  Please make sure you are using a “PS” to designate the supply item or a \"PD\" to designate supply/distributor.  For items leased or rented please use code “L” under Firm Type Code instead of “P”"]
["** It is important to complete the regular dealer/distributor affirmation form in order to decide whether or not the subcontractor is truly a supplier and has a warehouse stocked with that item.  For purposes of this section, a regular dealer is a firm that owns (or leases) and-operates, a store, warehouse, or other establishment in which the materials, supplies, articles or equipment of the general character described by the specifications and required under the contract are bought, kept in sufficient quantities, and regularly sold or leased to the public in the usual course of business.  If the “DBE supplier” does not carry the item in stock nor do they have a warehouse where this item is transported from it is likely they will only be eligible for credit as a distributor in which that case they would only be eligible for 40% DBE credit.  If the materials or supplies are purchased from a DBE distributor that neither maintains sufficient inventory nor uses its own distribution equipment for the products in question, count 40% of the cost of materials or supplies (including transportation costs). A DBE distributor is an established business that engages in the regular sale or lease of the items specified by the contract. A DBE distributor assumes responsibility for the items it purchases once they leave the point of origin (e.g., a manufacturer's facility), making it liable for any loss or damage not covered by the carrier's insurance. A DBE distributor performs a CUF when it demonstrates ownership of the items in question and assumes all risk for loss or damage during transportation, evidenced by the terms of the purchase order or a bill of lading (BOL) from a third party, indicating Free on Board (FOB) at the point of origin or similar terms that transfer responsibility of the items in question to the DBE distributor. If these conditions are met, DBE distributors may receive 40 percent for drop-shipped items. Terms that transfer liability to the distributor at the delivery destination (e.g., FOB destination), or deliveries made or arranged by the manufacturer or another seller do not satisfy this requirement.  This is very important to make sure the distinction can be backed up.  This requires Prime contractors to establish pre-award procedures to determine whether a DBE supplier submitted by the contractor/bidder as a regular dealer or distributor has demonstrated the ability and intent to perform as a regular dealer or distributor during the contract, allowing 60% or 40%, respectively, of the cost of materials to count toward goal. This will ensure preliminary counting determinations and contract goal attainment decisions are based on the DBE’s ability and intent to comply with the rule’s commercially useful function (CUF) requirements."]
["***For a DBE supplier that does not meet the CUF of a manufacturer, regular dealer, nor a distributor (e.g., packagers, brokers, manufacturer’s representatives, or others that arrange, facilitate or expedite transactions) the reasonable amount of fees and commissions charged, such as delivery charges; do not count the cost of materials and supplies”"]
[]
{"$rows_left_out":12}
{"sheet":"Commitment Form","index":1,"n_rows":34,"n_cols":25,"rows_kept":34,"cut":false,"hidden":false,"merged":[[5,3,5,11],[14,0,14,26],[8,15,8,18],[9,19,9,20],[27,0,27,26],[23,0,24,5],[23,7,24,8],[25,0,25,5],[25,7,25,8],[23,16,24,22],[25,16,25,22],[25,24,25,25],[23,24,24,25],[19,0,19,10],[19,14,19,22],[19,24,19,25],[15,0,15,26],[11,0,12,11],[10,14,12,26],[7,10,7,11],[8,10,8,11],[0,0,0,26],[1,0,1,26],[2,0,2,26],[3,0,3,26],[10,6,10,8],[9,6,9,8],[8,3,8,8],[7,3,7,8],[9,14,9,18],[6,14,6,18],[8,24,8,25],[5,14,5,15],[5,16,5,25],[6,19,6,25],[7,15,7,25],[6,3,6,11]]}
["CONNECTICUT DEPARTMENT OF TRANSPORTATION (CTDOT)"]
["PRE-AWARD COMMITMENT APPROVAL REQUEST rev 8/2024"]
["TO BE SUBMITTED WITHIN 5 SAYS OF BID OPENING "]
["Only certified SBE/DBE firms and only for work which they have been certified for will be approved by CTDOT toward the set-aside or goal. Department's SBE/DBE directory is available on CTDOT's website.  Entries only required in blue shaded areas.  Areas not in blue are formulated from other pages."]
[]
["CTDOT Project Number(s): ",null,null,null,null,null,null,null,null,null,null,null,null,null,"Subcontractor:"]
["Project Description:",null,null,null,null,null,null,null,null,null,null,null,null,null,"NAICS Code(s) Associated With This Submission (DBE): "]
["Submitted By (Prime):",null,null,null,null,null,null,null,null,"FEIN No.:",null,null,null,null,"Address:"]
["Original Low Bid ($):",null,null,null,null,null,null,null,null,"SBE Set Aside/DBE Goal %",null,null,null,null,"FEIN No.",null,null,null,null,null,null,null,null,"DBE or SBE:"]
["Dollar amount subcontracted to this firm ($)",null,null,null,null,null,{"$f":"'Contract Items'!N2","v":0},null,null,null,null,null,null,null,"Is this DBE firm a 1st or 2nd tier subcontractor?"]
["Dollar Amount Requested for Credit for this Firm (DBE) ($):",null,null,null,null,null,{"$f":"'Contract Items'!O2","v":0},null,null,"**",null,null,null,null,"* The CTDOT prefers 1st tier Subcontractors; however, credit for 2nd tier DBE firms will be approved provided this page is signed by both the Prime and the DBE firm, the 1st tier Subcontractor is identified, the extent of the 2nd tier work is clearly identified, and the Prime makes the assertion that regardless of its arrangement with the 1st tier Subcontractor, this DBE firm will be used and its replacemnt is subject to the conditions of the DBE speciification and contract requirements. "]
["**Please be advised that by submitting this form you (the Prime) agree that the total Credited amount will be the amount of commitment and will be measured by the Commercially Useful Function (CUF) the Subcontractor performs. "]
[]
[]
["DBE commitment forms must be submitted to the department no more than 5 days from bid opening in a complete and final manner.  Revisions and/or re-submittals are not accepted past the 5-day mark.  Along with the required DBE commitment forms, you must submit the DBE quotes and any backup information needed to make a determination on eligibility.  In order to obtain DBE credit for work performed by a DBE firm the DBE firm must meet the Commercial Useful Function requirement (CUF)."]
[]
[]
[]
[]
["****Is this DBE Purchasing any Material or Leasing any Equipment from the Prime or any of the Prime's Affiliates?",null,null,null,null,null,null,null,null,null,null,null,null,null,"If YES, state the amount and DO NOT include the amount in the amount toward the goal. ",null,null,null,null,null,null,null,null,"Amount: $"]
{"$rows_left_out":15}
{"sheet":"Contract Items","index":2,"n_rows":307,"n_cols":16,"rows_kept":307,"cut":false,"hidden":false,"merged":[[93,3,93,4],[94,3,94,4],[95,3,95,4],[96,3,96,4],[97,3,97,4],[88,3,88,4],[89,3,89,4],[90,3,90,4],[91,3,91,4],[92,3,92,4],[103,3,103,4],[104,3,104,4],[105,3,105,4],[106,3,106,4],[98,3,98,4],[99,3,99,4],[100,3,100,4],[101,3,101,4],[102,3,102,4],[73,3,73,4],[74,3,74,4],[75,3,75,4],[76,3,76,4],[77,3,77,4],[4,14,6,14],[87,3,87,4],[78,3,78,4],[79,3,79,4],[80,3,80,4],[81,3,81,4],[82,3,82,4],[83,3,83,4],[84,3,84,4],[85,3,85,4],[86,3,86,4],[68,3,68,4],[69,3,69,4],[70,3,70,4],[71,3,71,4],[72,3,72,4],[63,3,63,4],[64,3,64,4],[65,3,65,4],[66,3,66,4],[67,3,67,4],[58,3,58,4],[59,3,59,4],[60,3,60,4],[61,3,61,4],[62,3,62,4],[53,3,53,4],[54,3,54,4],[55,3,55,4],[56,3,56,4],[57,3,57,4],[49,3,49,4],[50,3,50,4],[51,3,51,4],[52,3,52,4],[43,3,43,4],[44,3,44,4],[45,3,45,4],[46,3,46,4],[47,3,47,4],[20,3,20,4],[27,3,27,4],[28,3,28,4],[29,3,29,4],[23,3,23,4],[31,3,31,4],[21,3,21,4],[22,3,22,4],[48,3,48,4],[0,0,0,2],[1,0,1,2],[2,0,2,2],[2,3,2,4],[4,1,6,1],[4,2,6,2],[40,3,40,4],[41,3,41,4],[42,3,42,4],[36,3,36,4],[37,3,37,4],[38,3,38,4],[39,3,39,4],[32,3,32,4],[25,3,25,4],[26,3,26,4],[16,3,16,4],[17,3,17,4],[33,3,33,4],[34,3,34,4],[35,3,35,4],[30,3,30,4],[24,3,24,4],[19,3,19,4],[12,3,12,4],[13,3,13,4],[18,3,18,4],[7,3,7,4],[4,0,6,0],[14,3,14,4],[15,3,15,4],[8,3,8,4],[9,3,9,4],[10,3,10,4],[11,3,11,4],[4,13,6,13],[4,3,6,4],[4,7,6,7],[4,8,6,8],[4,6,6,6],[4,9,6,9],[4,5,6,5],[0,9,0,10],[1,9,1,10],[2,9,2,10],[4,10,6,10],[4,11,6,11],[4,12,6,12],[0,11,0,12],[1,11,1,12],[2,11,2,12],[1,3,1,4],[0,3,0,4],[107,3,107,4],[108,3,108,4],[109,3,109,4],[110,3,110,4],[111,3,111,4],[112,3,112,4],[113,3,113,4],[114,3,114,4],[115,3,115,4],[116,3,116,4],[117,3,117,4],[118,3,118,4],[119,3,119,4],[120,3,120,4],[121,3,121,4],[122,3,122,4],[123,3,123,4],[124,3,124,4],[140,3,140,4],[141,3,141,4],[142,3,142,4],[125,3,125,4],[126,3,126,4],[127,3,127,4],[128,3,128,4],[129,3,129,4],[130,3,130,4],[131,3,131,4],[134,3,134,4],[135,3,135,4],[136,3,136,4],[137,3,137,4],[138,3,138,4],[139,3,139,4],[132,3,132,4],[133,3,133,4],[143,3,143,4],[144,3,144,4],[145,3,145,4],[146,3,146,4],[147,3,147,4],[148,3,148,4],[149,3,149,4],[150,3,150,4],[151,3,151,4],[152,3,152,4],[153,3,153,4],[154,3,154,4],[155,3,155,4],[156,3,156,4],[157,3,157,4],[158,3,158,4],[159,3,159,4],[160,3,160,4],[176,3,176,4],[177,3,177,4],[178,3,178,4],[161,3,161,4],[162,3,162,4],[163,3,163,4],[164,3,164,4],[165,3,165,4],[166,3,166,4],[167,3,167,4],[170,3,170,4],[171,3,171,4],[172,3,172,4],[173,3,173,4],[174,3,174,4],[175,3,175,4],[168,3,168,4],[169,3,169,4],[179,3,179,4],[180,3,180,4],[181,3,181,4],[182,3,182,4],[183,3,183,4],[184,3,184,4],[185,3,185,4],[186,3,186,4],[187,3,187,4],[188,3,188,4],[189,3,189,4],[190,3,190,4],[191,3,191,4],[192,3,192,4],[193,3,193,4],[194,3,194,4],[195,3,195,4],[196,3,196,4],[212,3,212,4],[213,3,213,4],[214,3,214,4],[197,3,197,4],[198,3,198,4],[199,3,199,4],[200,3,200,4],[201,3,201,4],[202,3,202,4],[203,3,203,4],[206,3,206,4],[207,3,207,4],[208,3,208,4],[209,3,209,4],[210,3,210,4],[211,3,211,4],[204,3,204,4],[205,3,205,4],[215,3,215,4],[216,3,216,4],[217,3,217,4],[218,3,218,4],[219,3,219,4],[220,3,220,4],[221,3,221,4],[222,3,222,4],[223,3,223,4],[224,3,224,4],[225,3,225,4],[226,3,226,4],[227,3,227,4],[228,3,228,4],[229,3,229,4],[230,3,230,4],[231,3,231,4],[232,3,232,4],[248,3,248,4],[249,3,249,4],[250,3,250,4],[233,3,233,4],[234,3,234,4],[235,3,235,4],[236,3,236,4],[237,3,237,4],[238,3,238,4],[239,3,239,4],[242,3,242,4],[243,3,243,4],[244,3,244,4],[245,3,245,4],[246,3,246,4],[247,3,247,4],[240,3,240,4],[241,3,241,4],[251,3,251,4],[252,3,252,4],[253,3,253,4],[254,3,254,4],[255,3,255,4],[256,3,256,4],[257,3,257,4],[258,3,258,4],[259,3,259,4],[260,3,260,4],[261,3,261,4],[262,3,262,4],[263,3,263,4],[264,3,264,4],[265,3,265,4],[266,3,266,4],[267,3,267,4],[268,3,268,4],[284,3,284,4],[285,3,285,4],[286,3,286,4],[269,3,269,4],[270,3,270,4],[271,3,271,4],[272,3,272,4],[273,3,273,4],[274,3,274,4],[275,3,275,4],[278,3,278,4],[279,3,279,4],[280,3,280,4],[281,3,281,4],[282,3,282,4],[283,3,283,4],[276,3,276,4],[277,3,277,4],[287,3,287,4],[288,3,288,4],[289,3,289,4],[290,3,290,4],[291,3,291,4],[292,3,292,4],[293,3,293,4],[294,3,294,4],[295,3,295,4],[305,3,305,4],[306,3,306,4],[296,3,296,4],[297,3,297,4],[298,3,298,4],[299,3,299,4],[300,3,300,4],[301,3,301,4],[302,3,302,4],[303,3,303,4],[304,3,304,4]]}
["Project Number:",null,null,{"$f":"IF('Commitment Form'!D6=\"\", \"\", 'Commitment Form'!D6)","v":""},null,null,null,null,null,null,null,null,null,"Total Subcontracted","Total Credit Requested"]
["Prime Contractor:",null,null,{"$f":"IF('Commitment Form'!D8=\"\", \"\", 'Commitment Form'!D8)","v":""},null,null,null,null,null,null,null,null,null,{"$f":"SUM(N8:N307)","v":0},{"$f":"SUM(O8:O307)","v":0}]
["SBE/DBE Subcontractor:",null,null,{"$f":"IF('Commitment Form'!Q6=\"\", \"\", 'Commitment Form'!Q6)","v":""}]
[]
["#","Contract Item Line #","Item ID #","Item Description",null,"Firm Type Code","Partial Item? (Y/N)","Prime Unit of Measure","Prime Unit Price","Prime Quantity","Sub Unit of Measure","Sub Unit Price","Sub Quantity","Total Item Value Subcontracted","Total Credit Requested"]
[]
[]
[1,null,null,null,null,null,null,null,null,null,null,null,null,{"$f":"IF(OR(L8=\"\",M8=\"\"),\"\",L8*M8)","v":""},{"$f":"IF('Commitment Form'!$Y$9:$Z$9<>\"DBE\", \"\", IF(F8=\"PS\", (0.6*N8), IF(F8=\"PD\", (0.4*N8), N8)))","v":""},""]
[2,null,null,null,null,null,null,null,null,null,null,null,null,{"$f":"IF(OR(L9=\"\",M9=\"\"),\"\",L9*M9)","v":""},{"$f":"IF('Commitment Form'!$Y$9:$Z$9<>\"DBE\", \"\", IF(F9=\"PS\", (0.6*N9), IF(F9=\"PD\", (0.4*N9), N9)))","v":""},""]
[3,null,null,null,null,null,null,null,null,null,null,null,null,"",{"$f":"IF('Commitment Form'!$Y$9:$Z$9<>\"DBE\", \"\", IF(F10=\"PS\", (0.6*N10), IF(F10=\"PD\", (0.4*N10), N10)))","v":""},""]
[4,null,null,null,null,null,null,null,null,null,null,null,null,"",{"$f":"IF('Commitment Form'!$Y$9:$Z$9<>\"DBE\", \"\", IF(F11=\"PS\", (0.6*N11), IF(F11=\"PD\", (0.4*N11), N11)))","v":""},""]
[5,null,null,null,null,null,null,null,null,null,null,null,null,"",{"$f":"IF('Commitment Form'!$Y$9:$Z$9<>\"DBE\", \"\", IF(F12=\"PS\", (0.6*N12), IF(F12=\"PD\", (0.4*N12), N12)))","v":""},""]
[6,null,null,null,null,null,null,null,null,null,null,null,null,"",{"$f":"IF('Commitment Form'!$Y$9:$Z$9<>\"DBE\", \"\", IF(F13=\"PS\", (0.6*N13), IF(F13=\"PD\", (0.4*N13), N13)))","v":""},""]
[7,null,null,null,null,null,null,null,null,null,null,null,null,"",{"$f":"IF('Commitment Form'!$Y$9:$Z$9<>\"DBE\", \"\", IF(F14=\"PS\", (0.6*N14), IF(F14=\"PD\", (0.4*N14), N14)))","v":""},""]
[8,null,null,null,null,null,null,null,null,null,null,null,null,"",{"$f":"IF('Commitment Form'!$Y$9:$Z$9<>\"DBE\", \"\", IF(F15=\"PS\", (0.6*N15), IF(F15=\"PD\", (0.4*N15), N15)))","v":""},""]
[9,null,null,null,null,null,null,null,null,null,null,null,null,"",{"$f":"IF('Commitment Form'!$Y$9:$Z$9<>\"DBE\", \"\", IF(F16=\"PS\", (0.6*N16), IF(F16=\"PD\", (0.4*N16), N16)))","v":""},""]
[10,null,null,null,null,null,null,null,null,null,null,null,null,"",{"$f":"IF('Commitment Form'!$Y$9:$Z$9<>\"DBE\", \"\", IF(F17=\"PS\", (0.6*N17), IF(F17=\"PD\", (0.4*N17), N17)))","v":""},""]
[11,null,null,null,null,null,null,null,null,null,null,null,null,"",{"$f":"IF('Commitment Form'!$Y$9:$Z$9<>\"DBE\", \"\", IF(F18=\"PS\", (0.6*N18), IF(F18=\"PD\", (0.4*N18), N18)))","v":""},""]
[12,null,null,null,null,null,null,null,null,null,null,null,null,"",{"$f":"IF('Commitment Form'!$Y$9:$Z$9<>\"DBE\", \"\", IF(F19=\"PS\", (0.6*N19), IF(F19=\"PD\", (0.4*N19), N19)))","v":""},""]
[13,null,null,null,null,null,null,null,null,null,null,null,null,"",{"$f":"IF('Commitment Form'!$Y$9:$Z$9<>\"DBE\", \"\", IF(F20=\"PS\", (0.6*N20), IF(F20=\"PD\", (0.4*N20), N20)))","v":""},""]
{"$rows_left_out":288}
{"sheet":"Data","index":3,"n_rows":9,"n_cols":11,"rows_kept":9,"cut":false,"hidden":true,"merged":[]}
["Item Type",null,"Special Prov",null,"Partial Item",null,"First or Second Tier",null,"Firm Type Code",null,"DBE or SBE"]
[]
["Original",null,"YES",null,"YES",null,"1st Tier",null,"S",null,"DBE"]
["CO",null,"NO",null,"NO",null,"2nd Tier",null,"M",null,"SBE"]
[null,null,null,null,null,null,null,null,"PD"]
[null,null,null,null,null,null,null,null,"PS"]
[null,null,null,null,null,null,null,null,"T"]
[null,null,null,null,null,null,null,null,"V"]
[null,null,null,null,null,null,null,null,"L"]