{"text_format":"1","workbook":"xlsx","n_sheets":5,"sheets":["SELECTION OPTIONS","Calculator","Revised","Dropdowns","Original"],"not_rendered":{"charts":0,"images":0,"macros":1,"external_links":0,"defined_names":2,"comments":0,"pivot_tables":0},"unopened":[],"bounds":{"document_bytes":16777216,"sheet_cells":100000,"rows_first":2000,"rows_last":500,"rows_between":2000,"halvings":0,"cell_chars":16384,"cell_head_chars":4096},"cells_cut":0,"cells_raw":0,"read":"whole","date_system":"1900"}

{"sheet":"SELECTION OPTIONS","index":0,"n_rows":15,"n_cols":4,"rows_kept":15,"cut":false,"hidden":false,"merged":[]}
[]
[]
[null,"Project ","Select Project Type: (COLUMN D in TAB \"Calculator\")","Select Project Priority: (COLUMN F in TAB \"Calculator\")"]
[null,"Renovations","General Construction","Priority"]
[null,"Extensions","General Construction","Priority"]
[null,"Major alterations of an existing school building","General Construction","Priority"]
[null,"Code Violations","General Construction","Non-Priority"]
[null,"Roof Replacements","General Construction","Non-Priority"]
[null,"New construction or replacement of a school building when a town or regional school district can demonstration that new construction or replacement is less expensive than a renovation, extension or major alteration of an existing school building","General Construction","Priority"]
[null,"HVAC","General Construction","HVAC"]
[null,"New Construction","New Construction","Priority"]
[null,"Replacement of a school building","New Construction","Priority"]
[]
[null,"CLICK TO CALCULATE REIMBURSEMENT RATE:"]
[null,"Calculator"]

{"sheet":"Calculator","index":1,"n_rows":25,"n_cols":10,"rows_kept":25,"cut":false,"hidden":false,"merged":[]}
[null,null,null,null,null,"DEPARTMENT OF ADMINISTRATIVE SERVICES (DAS)"]
[null,null,null,null,null,"OFFICE OF GRANTS ADMINISTRATION"]
[null,null,null,null,null,"SCHOOL CONSTRUCTION REIMBURSEMENT RATE CALCULATOR"]
[null,"Town, District, or Regional Educational Service Center (RESC)",null,"Project Type *                                                                                     Please see the list below from row 8.",null,"Project Priority is:",null,{"$f":"IFERROR(Dropdowns!$T$10,\"Date\")","v":"Date application was submitted (or anticipated date)"},null,"Reimbursement Rate               The Rate below does not consider bonuses; those will be calculated on a case-by-case basis."]
[null,"Woodstock Acad.",null,"General Construction",null,"HVAC",null,"2019-01-01",null,{"$f":"IFERROR(INDEX(Revised!$G$2:$S$196,MATCH($B$5,Revised!$G$2:$G$196,0),MATCH(Revised!$C$9,Revised!$G$1:$S$1,0)),\"\")","v":0.69289999999999996}]
[]
[null,"Please CLICK in the green cell and select from the dropdown list your Town, District, or Regional Educational Service Center (RESC).",null,"Please CLICK in the green cell and select from the dropdown list \"New Construction\" or \"General Construction.\" ",null,"Please CLICK in the green cell and select from the dropdown list \"Priority, \"Non-Priority,\" or \"HVAC.\"                                                                     Note: All New Projects are considered \"Priority.\" HVAC is considered \"General\" construction.",null,"Please CLICK in the green cell and add a date between 7/1/2018 and 6/30/2024."]
[null,null,null,null,null,null,null,"If checking for grant information from a year before 2019 or after 2024, please contact the State of Connecticut at DAS.GrantsAdministration@ct.gov."]
[]
[null,null,null,"Project Type *"]
[null,null,null,"General Construction"]
[null,null,null,"Reimbursement rates are between 20% and 80%."]
[null,null,null,"·        Types of projects include: "]
[null,null,null,"o   Renovations (priority)"]
[null,null,null,"o   Extensions (priority)"]
[null,null,null,"o   Major alterations of an existing school building (priority)"]
[null,null,null,"o   Code violations (nonpriority)"]
[null,null,null,"o   Roof replacements (nonpriority)"]
[null,null,null,"o   New construction or replacement of a school building when a town or regional school district can demonstrate that new construction or replacement is less expensive than a renovation, extension, or major alteration of an existing school building (priority)"]
[null,null,null,"o   HVAC "]
{"$rows_left_out":6}
{"sheet":"Revised","index":2,"n_rows":196,"n_cols":35,"rows_kept":196,"cut":false,"hidden":true,"merged":[]}
[null,null,null,null,null,"District\nCode","District Name","2019 General Construction","2019 New","2020 General Construction","2020 New","2021 General Construction","2021 New","2022 General Construction","2022 New","2023 General Construction","2023 New","2024 General Construction","2024 New",null,null,"District Code","District Name","General Calc1","New Calc1",null,"Test District Code","Test District Name","Test General Calc1","Test New Calc1",null,"DisNum","DistrictName"]
["2018-07-01","2019-06-30",2019,null,null,1,"ANDOVER",0.5786,0.47860000000000003,0.5857,0.48570000000000002,0.58930000000000005,0.48930000000000001,0.58930000000000005,0.48930000000000001,0.59289999999999998,0.4929,0.60360000000000003,0.50360000000000005,null,null,1,"ANDOVER",0.60360000000000003,0.50360000000000005,null,{"$f":"IF(F2=V2,\"\",\"X\")","v":""},{"$f":"IF(G2=W2,\"\",\"X\")","v":""},{"$f":"IF(R2=X2,\"\",\"X\")","v":""},{"$f":"IF(S2=Y2,\"\",\"X\")","v":""},null,1,"ANDOVER",{"$f":"IF(F2=AF2,\"\",\"X\")","v":""},{"$f":"IF(G2=AG2,\"\",\"X\")","v":""}]
["2019-07-01","2020-06-30",2020,null,null,2,"ANSONIA",0.77139999999999997,0.6714,0.77500000000000002,0.67500000000000004,0.77500000000000002,0.67500000000000004,0.77859999999999996,0.67859999999999998,0.77859999999999996,0.67859999999999998,0.77859999999999996,0.67859999999999998,null,null,2,"ANSONIA",0.77859999999999996,0.67859999999999998,null,{"$f":"IF(F3=V3,\"\",\"X\")","v":""},"",{"$f":"IF(R3=X3,\"\",\"X\")","v":""},"",null,2,"ANSONIA",{"$f":"IF(F3=AF3,\"\",\"X\")","v":""},""]
["2020-07-01","2021-06-30",2021,null,null,3,"ASHFORD",0.63929999999999998,0.5393,0.6321,0.53210000000000002,0.63570000000000004,0.53569999999999995,0.63570000000000004,0.53569999999999995,0.65359999999999996,0.55359999999999998,0.66789999999999994,0.56789999999999996,null,null,3,"ASHFORD",0.66789999999999994,0.56789999999999996,null,"","","","",null,3,"ASHFORD","",""]
["2021-07-01","2022-06-30",2022,null,null,4,"AVON",0.2893,0.1893,0.28570000000000001,0.1857,0.27500000000000002,0.17499999999999999,0.27500000000000002,0.17499999999999999,0.27500000000000002,0.17499999999999999,0.27860000000000001,0.17860000000000001,null,null,4,"AVON",0.27860000000000001,0.17860000000000001,null,"","","","",null,4,"AVON","",""]
["2022-07-01","2023-06-30",2023,null,null,5,"BARKHAMSTED",0.51070000000000004,0.41070000000000001,0.51070000000000004,0.41070000000000001,0.52139999999999997,0.4214,0.51790000000000003,0.41789999999999999,0.50360000000000005,0.40360000000000001,0.50360000000000005,0.40359999999999996,null,null,5,"BARKHAMSTED",0.50360000000000005,0.40359999999999996,null,"","","","",null,5,"BARKHAMSTED","",""]
["2023-07-01","2024-06-30",2024,null,null,6,"BEACON FALLS",0.63570000000000004,0.53569999999999995,0.63570000000000004,0.53569999999999995,0.6321,0.53210000000000002,0.62860000000000005,0.52859999999999996,0.62860000000000005,0.52859999999999996,0.62860000000000005,0.52859999999999996,null,null,6,"BEACON FALLS",0.62860000000000005,0.52859999999999996,null,"","","","",null,6,"BEACON FALLS","",""]
[null,null,null,null,null,7,"BERLIN",0.4214,0.32140000000000002,0.45,0.35,0.44640000000000002,0.34639999999999999,0.44290000000000002,0.34289999999999998,0.4143,0.31430000000000002,0.4143,0.31430000000000002,null,null,7,"BERLIN",0.4143,0.31430000000000002,null,"","","","",null,7,"BERLIN","",""]
[{"$f":"IF(AND(Calculator!$H$5>=$A2,Calculator!$H$5<=$B2),$C2,IF(AND(Calculator!$H$5>=$A3,Calculator!$H$5<=$B3),$C3,IF(AND(Calculator!$H$5>=$A4,Calculator!$H$5<=$B4),$C4,IF(AND(Calculator!$H$5>=$A5,Calculator!$H$5<=$B5),$C5,IF(AND(Calculator!$H$5>=$A6,Calculator!$H$5<=$B6),$C6,IF(AND(Calculator!$H$5>=$A7,Calculator!$H$5<=$B7),$C7,\"Please email the State of CT\"))))))","v":2019},{"$f":"IF(Calculator!F5=\"Priority\",\"New\",IF(Calculator!F5=\"Non-Priority\",\"General Construction\",IF(Calculator!F5=\"HVAC\",\"General Construction\",\"\")))","v":"General Construction"},{"$f":"_xlfn.CONCAT(A9,\" \",B9)","v":"2019 General Construction"},null,null,8,"BETHANY",0.37859999999999999,0.27860000000000001,0.39279999999999998,0.2928,0.4,0.3,0.41070000000000001,0.31069999999999998,0.4,0.3,0.375,0.27500000000000002,null,null,8,"BETHANY",0.375,0.27500000000000002,null,"","","","",null,8,"BETHANY","",""]
[null,null,null,null,null,9,"BETHEL",0.48209999999999997,0.3821,0.48570000000000002,0.38569999999999999,0.46779999999999999,0.36780000000000002,0.46429999999999999,0.36430000000000001,0.4607,0.36070000000000002,0.47139999999999999,0.37139999999999995,null,null,9,"BETHEL",0.47139999999999999,0.37139999999999995,null,"","","","",null,9,"BETHEL","",""]
[null,null,null,null,null,10,"BETHLEHEM",0.43569999999999998,0.3357,0.44290000000000002,0.34289999999999998,0.43209999999999998,0.33210000000000001,0.4143,0.31430000000000002,0.4536,0.35360000000000003,0.45,0.35,null,null,10,"BETHLEHEM",0.45,0.35,null,"","","","",null,10,"BETHLEHEM","",""]
[null,null,null,null,null,11,"BLOOMFIELD",0.47860000000000003,0.37859999999999999,0.47499999999999998,0.375,0.47860000000000003,0.37859999999999999,0.47499999999999998,0.375,0.5,0.4,0.5071,0.40710000000000002,null,null,11,"BLOOMFIELD",0.5071,0.40710000000000002,null,"","","","",null,11,"BLOOMFIELD","",""]
[null,null,null,null,null,12,"BOLTON",0.4929,0.39290000000000003,0.48209999999999997,0.3821,0.47139999999999999,0.37140000000000001,0.47139999999999999,0.37140000000000001,0.47139999999999999,0.37140000000000001,0.48930000000000001,0.38929999999999998,null,null,12,"BOLTON",0.48930000000000001,0.38929999999999998,null,"","","","",null,12,"BOLTON","",""]
[null,null,null,null,null,13,"BOZRAH",0.56430000000000002,0.46429999999999999,0.6,0.5,0.61429999999999996,0.51429999999999998,0.62139999999999995,0.52139999999999997,0.6,0.5,0.59640000000000004,0.49639999999999995,null,null,13,"BOZRAH",0.59640000000000004,0.49639999999999995,null,"","","","",null,13,"BOZRAH","",""]
[null,null,null,null,null,14,"BRANFORD",0.36430000000000001,0.26429999999999998,0.36430000000000001,0.26429999999999998,0.36430000000000001,0.26429999999999998,0.36070000000000002,0.26069999999999999,0.34639999999999999,0.24640000000000001,0.34640000000000004,0.24640000000000001,null,null,14,"BRANFORD",0.34640000000000004,0.24640000000000001,null,"","","","",null,14,"BRANFORD","",""]
[null,null,null,null,null,15,"BRIDGEPORT",0.7893,0.68930000000000002,0.7893,0.68930000000000002,0.7893,0.68930000000000002,0.78569999999999995,0.68569999999999998,0.78569999999999995,0.68569999999999998,0.78570000000000007,0.68569999999999998,null,null,15,"BRIDGEPORT",0.78570000000000007,0.68569999999999998,null,"","","","",null,15,"BRIDGEPORT","",""]
[null,null,null,null,null,16,"BRIDGEWATER",0.24279999999999999,0.14280000000000001,0.24279999999999999,0.14280000000000001,0.23930000000000001,0.13930000000000001,0.24279999999999999,0.14280000000000001,0.23930000000000001,0.13930000000000001,0.23930000000000001,0.13930000000000001,null,null,16,"BRIDGEWATER",0.23930000000000001,0.13930000000000001,null,"","","","",null,16,"BRIDGEWATER","",""]
[null,null,null,null,null,17,"BRISTOL",0.70709999999999995,0.60709999999999997,0.7,0.6,0.68930000000000002,0.58930000000000005,0.69279999999999997,0.59279999999999999,0.69640000000000002,0.59640000000000004,0.71429999999999993,0.61429999999999996,null,null,17,"BRISTOL",0.71429999999999993,0.61429999999999996,null,"","","","",null,17,"BRISTOL","",""]
[null,null,null,null,null,18,"BROOKFIELD",0.31430000000000002,0.21429999999999999,0.31430000000000002,0.21429999999999999,0.31430000000000002,0.21429999999999999,0.3286,0.2286,0.33929999999999999,0.23930000000000001,0.33930000000000005,0.23930000000000001,null,null,18,"BROOKFIELD",0.33930000000000005,0.23930000000000001,null,"","","","",null,18,"BROOKFIELD","",""]
[null,null,null,null,null,19,"BROOKLYN",0.74639999999999995,0.64639999999999997,0.73929999999999996,0.63929999999999998,0.73929999999999996,0.63929999999999998,0.72860000000000003,0.62860000000000005,0.72499999999999998,0.625,0.70710000000000006,0.60709999999999997,null,null,19,"BROOKLYN",0.70710000000000006,0.60709999999999997,null,"","","","",null,19,"BROOKLYN","",""]
{"$rows_left_out":177}
{"sheet":"Dropdowns","index":3,"n_rows":196,"n_cols":20,"rows_kept":196,"cut":false,"hidden":true,"merged":[]}
[null,"Town, District, or Regional Educational Service Center (RESC)",null,null,null,null,null,null,"Project Type",null,null,"Priority"]
[null,"ANDOVER",null,null,null,null,null,null,"New Construction",null,null,"New Construction","General Construction",null,{"$f":"_xlfn.UNIQUE(_xlfn.XLOOKUP(Calculator!$D$5,Dropdowns!$L$2:$M$2,Dropdowns!$L$3:$M$5),,TRUE)","v":"Priority"}]
[null,"ANSONIA",null,null,null,null,null,null,"General Construction",null,null,"Priority","Priority",null,"Non-Priority"]
[null,"ASHFORD",null,null,null,null,null,null,null,null,null,null,"Non-Priority",null,"HVAC"]
[null,"AVON",null,null,null,null,null,null,null,null,null,null,"HVAC"]
[null,"BARKHAMSTED"]
[null,"BEACON FALLS"]
[null,"BERLIN"]
[null,"BETHANY"]
[null,"BETHEL",null,null,null,null,null,null,null,null,null,null,"Priority","HVAC","Non-Priority",null,null,null,null,{"$f":"_xlfn.XLOOKUP(Calculator!$F$5,Dropdowns!$M$10:$O$10,Dropdowns!$M$11:$O$11)","v":"Date application was submitted (or anticipated date)"}]
[null,"BETHLEHEM",null,null,null,null,null,null,null,null,null,null,"Date of local authority funding authorization","Date application was submitted (or anticipated date)","Date application was submitted (or anticipated date)"]
[null,"BLOOMFIELD"]
[null,"BOLTON"]
[null,"BOZRAH"]
[null,"BRANFORD"]
[null,"BRIDGEPORT"]
[null,"BRIDGEWATER"]
[null,"BRISTOL"]
[null,"BROOKFIELD"]
[null,"BROOKLYN"]
{"$rows_left_out":177}
{"sheet":"Original","index":4,"n_rows":196,"n_cols":30,"rows_kept":196,"cut":false,"hidden":true,"merged":[]}
["District\nCode","District Name","2019\nGeneral\nConstruction","2019 New","2020\nGeneral\nConstruction","2020 New","2021\nGeneral\nConstruction","2021 New","2022\nGeneral\nConstruction","2022 New","2023\nGeneral\nConstruction","2023 New","2024\nGeneral\nConstruction","2024 New",null,null,"District Code","District Name","General Calc1","New Calc1",null,"Test District Code","Test District Name","Test General Calc1","Test New Calc1",null,"DisNum","DistrictName"]
[1,"ANDOVER",0.5786,0.47860000000000003,0.5857,0.48570000000000002,0.58930000000000005,0.48930000000000001,0.58930000000000005,0.48930000000000001,0.59289999999999998,0.4929,0.60360000000000003,0.50360000000000005,null,null,1,"ANDOVER",0.60360000000000003,0.50360000000000005,null,{"$f":"IF(A2=Q2,\"\",\"X\")","v":""},{"$f":"IF(B2=R2,\"\",\"X\")","v":""},{"$f":"IF(M2=S2,\"\",\"X\")","v":""},{"$f":"IF(N2=T2,\"\",\"X\")","v":""},null,1,"ANDOVER",{"$f":"IF(A2=AA2,\"\",\"X\")","v":""},{"$f":"IF(B2=AB2,\"\",\"X\")","v":""}]
[2,"ANSONIA",0.77139999999999997,0.6714,0.77500000000000002,0.67500000000000004,0.77500000000000002,0.67500000000000004,0.77859999999999996,0.67859999999999998,0.77859999999999996,0.67859999999999998,0.77859999999999996,0.67859999999999998,null,null,2,"ANSONIA",0.77859999999999996,0.67859999999999998,null,{"$f":"IF(A3=Q3,\"\",\"X\")","v":""},{"$f":"IF(B3=R3,\"\",\"X\")","v":""},{"$f":"IF(M3=S3,\"\",\"X\")","v":""},{"$f":"IF(N3=T3,\"\",\"X\")","v":""},null,2,"ANSONIA",{"$f":"IF(A3=AA3,\"\",\"X\")","v":""},""]
[3,"ASHFORD",0.63929999999999998,0.5393,0.6321,0.53210000000000002,0.63570000000000004,0.53569999999999995,0.63570000000000004,0.53569999999999995,0.65359999999999996,0.55359999999999998,0.66789999999999994,0.56789999999999996,null,null,3,"ASHFORD",0.66789999999999994,0.56789999999999996,null,"","","","",null,3,"ASHFORD","",""]
[4,"AVON",0.2893,0.1893,0.28570000000000001,0.1857,0.27500000000000002,0.17499999999999999,0.27500000000000002,0.17499999999999999,0.27500000000000002,0.17499999999999999,0.27860000000000001,0.17860000000000001,null,null,4,"AVON",0.27860000000000001,0.17860000000000001,null,"","","","",null,4,"AVON","",""]
[5,"BARKHAMSTED",0.51070000000000004,0.41070000000000001,0.51070000000000004,0.41070000000000001,0.52139999999999997,0.4214,0.51790000000000003,0.41789999999999999,0.50360000000000005,0.40360000000000001,0.50360000000000005,0.40359999999999996,null,null,5,"BARKHAMSTED",0.50360000000000005,0.40359999999999996,null,"","","","",null,5,"BARKHAMSTED","",""]
[6,"BEACON FALLS",0.63570000000000004,0.53569999999999995,0.63570000000000004,0.53569999999999995,0.6321,0.53210000000000002,0.62860000000000005,0.52859999999999996,0.62860000000000005,0.52859999999999996,0.62860000000000005,0.52859999999999996,null,null,6,"BEACON FALLS",0.62860000000000005,0.52859999999999996,null,"","","","",null,6,"BEACON FALLS","",""]
[7,"BERLIN",0.4214,0.32140000000000002,0.45,0.35,0.44640000000000002,0.34639999999999999,0.44290000000000002,0.34289999999999998,0.4143,0.31430000000000002,0.4143,0.31430000000000002,null,null,7,"BERLIN",0.4143,0.31430000000000002,null,"","","","",null,7,"BERLIN","",""]
[8,"BETHANY",0.37859999999999999,0.27860000000000001,0.39279999999999998,0.2928,0.4,0.3,0.41070000000000001,0.31069999999999998,0.4,0.3,0.375,0.27500000000000002,null,null,8,"BETHANY",0.375,0.27500000000000002,null,"","","","",null,8,"BETHANY","",""]
[9,"BETHEL",0.48209999999999997,0.3821,0.48570000000000002,0.38569999999999999,0.46779999999999999,0.36780000000000002,0.46429999999999999,0.36430000000000001,0.4607,0.36070000000000002,0.47139999999999999,0.37139999999999995,null,null,9,"BETHEL",0.47139999999999999,0.37139999999999995,null,"","","","",null,9,"BETHEL","",""]
[10,"BETHLEHEM",0.43569999999999998,0.3357,0.44290000000000002,0.34289999999999998,0.43209999999999998,0.33210000000000001,0.4143,0.31430000000000002,0.4536,0.35360000000000003,0.45,0.35,null,null,10,"BETHLEHEM",0.45,0.35,null,"","","","",null,10,"BETHLEHEM","",""]
[11,"BLOOMFIELD",0.47860000000000003,0.37859999999999999,0.47499999999999998,0.375,0.47860000000000003,0.37859999999999999,0.47499999999999998,0.375,0.5,0.4,0.5071,0.40710000000000002,null,null,11,"BLOOMFIELD",0.5071,0.40710000000000002,null,"","","","",null,11,"BLOOMFIELD","",""]
[12,"BOLTON",0.4929,0.39290000000000003,0.48209999999999997,0.3821,0.47139999999999999,0.37140000000000001,0.47139999999999999,0.37140000000000001,0.47139999999999999,0.37140000000000001,0.48930000000000001,0.38929999999999998,null,null,12,"BOLTON",0.48930000000000001,0.38929999999999998,null,"","","","",null,12,"BOLTON","",""]
[13,"BOZRAH",0.56430000000000002,0.46429999999999999,0.6,0.5,0.61429999999999996,0.51429999999999998,0.62139999999999995,0.52139999999999997,0.6,0.5,0.59640000000000004,0.49639999999999995,null,null,13,"BOZRAH",0.59640000000000004,0.49639999999999995,null,"","","","",null,13,"BOZRAH","",""]
[14,"BRANFORD",0.36430000000000001,0.26429999999999998,0.36430000000000001,0.26429999999999998,0.36430000000000001,0.26429999999999998,0.36070000000000002,0.26069999999999999,0.34639999999999999,0.24640000000000001,0.34640000000000004,0.24640000000000001,null,null,14,"BRANFORD",0.34640000000000004,0.24640000000000001,null,"","","","",null,14,"BRANFORD","",""]
[15,"BRIDGEPORT",0.7893,0.68930000000000002,0.7893,0.68930000000000002,0.7893,0.68930000000000002,0.78569999999999995,0.68569999999999998,0.78569999999999995,0.68569999999999998,0.78570000000000007,0.68569999999999998,null,null,15,"BRIDGEPORT",0.78570000000000007,0.68569999999999998,null,"","","","",null,15,"BRIDGEPORT","",""]
[16,"BRIDGEWATER",0.24279999999999999,0.14280000000000001,0.24279999999999999,0.14280000000000001,0.23930000000000001,0.13930000000000001,0.24279999999999999,0.14280000000000001,0.23930000000000001,0.13930000000000001,0.23930000000000001,0.13930000000000001,null,null,16,"BRIDGEWATER",0.23930000000000001,0.13930000000000001,null,"","","","",null,16,"BRIDGEWATER","",""]
[17,"BRISTOL",0.70709999999999995,0.60709999999999997,0.7,0.6,0.68930000000000002,0.58930000000000005,0.69279999999999997,0.59279999999999999,0.69640000000000002,0.59640000000000004,0.71429999999999993,0.61429999999999996,null,null,17,"BRISTOL",0.71429999999999993,0.61429999999999996,null,"","","","",null,17,"BRISTOL","",""]
[18,"BROOKFIELD",0.31430000000000002,0.21429999999999999,0.31430000000000002,0.21429999999999999,0.31430000000000002,0.21429999999999999,0.3286,0.2286,0.33929999999999999,0.23930000000000001,0.33930000000000005,0.23930000000000001,null,null,18,"BROOKFIELD",0.33930000000000005,0.23930000000000001,null,"","","","",null,18,"BROOKFIELD","",""]
[19,"BROOKLYN",0.74639999999999995,0.64639999999999997,0.73929999999999996,0.63929999999999998,0.73929999999999996,0.63929999999999998,0.72860000000000003,0.62860000000000005,0.72499999999999998,0.625,0.70710000000000006,0.60709999999999997,null,null,19,"BROOKLYN",0.70710000000000006,0.60709999999999997,null,"","","","",null,19,"BROOKLYN","",""]
{"$rows_left_out":176}