{"text_format":"1","workbook":"xlsx","n_sheets":16,"sheets":["Step 1 - Project Info","Core Services - Unit Matrix","Air Sealing (Blower Door)","Duct Sealing","Low Flow DHW","Dwelling Unit Lighting","Common and Exterior Lighting","Lighting Summary","Insulation","Window Replacements","Refrigerator Replacements","HVAC","Drop Down List","Custom Measure","Building Oil or Propane Usage","Dropdown"],"not_rendered":{"charts":0,"images":2,"macros":1,"external_links":1,"defined_names":15,"comments":1,"pivot_tables":0},"unopened":[],"bounds":{"document_bytes":16777216,"sheet_cells":100000,"rows_first":2000,"rows_last":500,"rows_between":2000,"halvings":0,"cell_chars":16384,"cell_head_chars":4096},"cells_cut":0,"cells_raw":0,"read":"whole","date_system":"1900"}

{"sheet":"Step 1 - Project Info","index":0,"n_rows":67,"n_cols":5,"rows_kept":67,"cut":false,"hidden":false,"merged":[[50,0,50,1],[0,1,0,2],[1,1,1,2]]}
["Multifamily Initiative Project Fill Out From"]
["Rev. 2016.03.24","PROJECT INFO"]
[null,"Property Name","Winem Apartments"]
[null,"Property Street Number","31"]
[null,"Property Street","Field St."]
[null,"Property Street Address Line 2"]
[null,"Property City","Ashford"]
[null,"Property Zip Code","06010"]
[null,"Customer Electric (Master) Account Number(s)"]
[null,"Customer Gas (Master) Account Number(s)"]
[null,"Customer Contact First Name (For LOA to be addressed to)","William"]
[null,"Customer Contact Last Name (For LOA to be addressed to)","Smith"]
[null,"Customer Contact Title","Director of Housing Management"]
[null,"Customer Company Name","Housing Care LLC"]
[null,"Customer Contact Phone Number","8605419852"]
{"$rows_left_out":53}
{"sheet":"Core Services - Unit Matrix","index":1,"n_rows":39,"n_cols":10,"rows_kept":39,"cut":false,"hidden":false,"merged":[[0,0,0,14]]}
[{"$f":"'Step 1 - Project Info'!$C$3&\" - \"&'Step 1 - Project Info'!$C$7","v":"Winem Apartments - Ashford"}]
[]
["Instructions"]
["Core services includes the following dwelling unit measures assessed and implemented by a weatherization contractor*: air sealing, duct sealing, water conservation (e.g., low flow shower heads, faucet aerators, pipe wrap), and light bulbs."]
["1) A 10% representative sampling of dwelling units across the multifamily property must be conducted to determine the energy savings opportunities. Units sampled should be 10% of each unit type based on # bedrooms/studios and location (e.g., top corner, top middle, bottom corner, bottom middle, middle floor corner, middle floor center, etc.)."]
["2) During sampling, a contractor will perform core services in each of the identified sample units."]
["3) For each sample unit, please complete the below table which summarizes the measures performed during sampling."]
["4) For each sample unit, provide detailed information regarding measures installed during sampling on the applicable tabs generated within this Project Fillout Form."]
[]
["Total Units by Type","Quantity"]
["Efficiency/ Studio"]
["1 Bedrooms"]
["2 Bedrooms"]
["3 Bedrooms"]
["4 Bedrooms"]
{"$rows_left_out":25}
{"sheet":"Air Sealing (Blower Door)","index":2,"n_rows":23,"n_cols":24,"rows_kept":23,"cut":false,"hidden":true,"merged":[[1,2,1,16],[6,12,6,14],[6,15,6,17],[6,18,6,20],[6,21,6,23],[5,12,5,23],[3,12,4,18],[3,6,4,11]]}
[]
[null,null,{"$f":"'Step 1 - Project Info'!$C$3&\" - \"&'Step 1 - Project Info'!$C$7","v":"Winem Apartments - Ashford"}]
[]
[null,null,"Total Number of Units",{"$f":"'Step 1 - Project Info'!C45","v":30},null,null,"Note: Units sample should be 10% of each unit type (# bedrooms/ Studios, Location (Top Corner, Top Middle, Bottom Corner, Bottom Middle, Mid Fl Corner, Mid Fl Center))",null,null,null,null,null,"Note: Provide before and after pictures of areas air sealed to get the post blower door results, Provide pictures of Manometer before and after readings. All picture files can be included in any form that is convenient to you (such as word, pdf, dropbox), however, it should be readable or visible by Eversource staff."]
[null,null,"Total Sample Units",{"$f":"COUNTA('Core Services - Unit Matrix'!C19:C36)","v":1}]
[null,null,"Name of Lead Technician w/ BPI Multifamily Certification ",null,null,null,null,null,null,null,null,null,"AIR SEALING DETAIL"]
[null,null,"Techician's BPI ID #",null,null,null,null,null,null,null,null,null,"(1) What was air sealed? Air sealing CFM reduction and location on exterior or interior wall",null,null,"(2) What was air sealed? Air sealing CFM reduction and location on exterior or interior wall",null,null,"(3) What was air sealed? Air sealing CFM reduction and location on exterior or interior wall",null,null,"(4) What was air sealed? Air sealing CFM reduction and location on exterior or interior wall"]
[null,null,"Sample Apt #","Is Entrance Door Interior/ Exterior?","Bedroom type (Studio, 1BDRM, etc..)","Unit Locations (Top, Corner, Bottom, Middle)","SqFT of Unit","Age (years) of Building","Pre Blower Door CFM at 50 PA","Post Blower Door CFM at 50","CFM Reduction ","NOTES","What was Air Sealed?","Air Sealing CFM Reduction","Interior Wall, Exterior Wall, Interior Ceiling, Attic Floor, Basement Ceiling, Interior Ceiling, Basement Exterior walls, Other please specify:","What was Air Sealed?","Air Sealing CFM Reduction","Interior Wall, Exterior Wall, Interior Ceiling, Attic Floor, Basement Ceiling, Interior Ceiling, Basement Exterior walls, Other please specify:","What was Air Sealed?","Air Sealing CFM Reduction","Interior Wall, Exterior Wall, Interior Ceiling, Attic Floor, Basement Ceiling, Interior Ceiling, Basement Exterior walls, Other please specify:","What was Air Sealed?","Air Sealing CFM Reduction","Interior Wall, Exterior Wall, Interior Ceiling, Attic Floor, Basement Ceiling, Interior Ceiling, Basement Exterior walls, Other please specify:"]
[null,"EXAMPLE",{"$f":"IF('Core Services - Unit Matrix'!D19=\"Air Sealing\",'Core Services - Unit Matrix'!C19,\"\")","v":"Unit 101"},"Interior","1 BDRM","TOP FL",1100,1980,1000,800,200,null,"bottom and top plate/ 35 CFM/ exterior wall",35,null,"Kitchen sink penetration",10,"interior wall","bathroom exhaust vent",12,"attic ceiling","bathroom exhaust vent","bathroom exhaust vent","bathroom exhaust vent"]
[null,null,{"$f":"IF('Core Services - Unit Matrix'!D20=\"Air Sealing\",'Core Services - Unit Matrix'!C20,\"\")","v":""}]
[null,null,{"$f":"IF('Core Services - Unit Matrix'!D21=\"Air Sealing\",'Core Services - Unit Matrix'!C21,\"\")","v":""}]
[null,null,{"$f":"IF('Core Services - Unit Matrix'!D22=\"Air Sealing\",'Core Services - Unit Matrix'!C22,\"\")","v":""}]
[null,null,{"$f":"IF('Core Services - Unit Matrix'!D23=\"Air Sealing\",'Core Services - Unit Matrix'!C23,\"\")","v":""}]
[null,null,{"$f":"IF('Core Services - Unit Matrix'!D24=\"Air Sealing\",'Core Services - Unit Matrix'!C24,\"\")","v":""}]
[null,null,{"$f":"IF('Core Services - Unit Matrix'!D25=\"Air Sealing\",'Core Services - Unit Matrix'!C25,\"\")","v":""}]
{"$rows_left_out":9}
{"sheet":"Duct Sealing","index":3,"n_rows":14,"n_cols":8,"rows_kept":14,"cut":false,"hidden":true,"merged":[]}
[{"$f":"\"Duct Blaster Testing - \" & 'Step 1 - Project Info'!C3","v":"Duct Blaster Testing - Winem Apartments"}]
[]
["Sample Apt #","Ductwork (Yes or No) / in condition or uncondition space","Bedroom type (Studio, 1BDRM, etc..)","Unit Locations (Top, Corner, Bottom, Middle)","SqFT of Unit","Pre Duct Blaster CFM at 25 PA","Post Duct Blaster CFM at 25","CFM Reduction "]
[{"$f":"IF('Core Services - Unit Matrix'!E19=\"Duct Sealing\",'Core Services - Unit Matrix'!C19,\"\")","v":"Unit 101"}]
[{"$f":"IF('Core Services - Unit Matrix'!E20=\"Duct Sealing\",'Core Services - Unit Matrix'!C20,\"\")","v":""}]
[{"$f":"IF('Core Services - Unit Matrix'!E21=\"Duct Sealing\",'Core Services - Unit Matrix'!C21,\"\")","v":""}]
[{"$f":"IF('Core Services - Unit Matrix'!E22=\"Duct Sealing\",'Core Services - Unit Matrix'!C22,\"\")","v":""}]
[{"$f":"IF('Core Services - Unit Matrix'!E23=\"Duct Sealing\",'Core Services - Unit Matrix'!C23,\"\")","v":""}]
[{"$f":"IF('Core Services - Unit Matrix'!E24=\"Duct Sealing\",'Core Services - Unit Matrix'!C24,\"\")","v":""}]
[{"$f":"IF('Core Services - Unit Matrix'!E25=\"Duct Sealing\",'Core Services - Unit Matrix'!C25,\"\")","v":""}]
[{"$f":"IF('Core Services - Unit Matrix'!E26=\"Duct Sealing\",'Core Services - Unit Matrix'!C26,\"\")","v":""}]
[{"$f":"IF('Core Services - Unit Matrix'!E27=\"Duct Sealing\",'Core Services - Unit Matrix'!C27,\"\")","v":""}]
[{"$f":"IF('Core Services - Unit Matrix'!E28=\"Duct Sealing\",'Core Services - Unit Matrix'!C28,\"\")","v":""}]
[{"$f":"IF('Core Services - Unit Matrix'!E29=\"Duct Sealing\",'Core Services - Unit Matrix'!C29,\"\")","v":""}]

{"sheet":"Low Flow DHW","index":4,"n_rows":34,"n_cols":11,"rows_kept":34,"cut":false,"hidden":true,"merged":[[2,4,2,7]]}
[]
[]
[null,null,null,null,{"$f":"'Step 1 - Project Info'!$C$3&\" - \"&'Step 1 - Project Info'!$C$7","v":"Winem Apartments - Ashford"}]
[]
[]
[null,null,null,null,"WATER MEASURES","Quantity","Cost per Measure","Total Cost"]
[null,null,null,null,"Hand Held Showerhead",null,null,{"$f":"G7*F7","v":0}]
["Flip & Swivel Aerator",null,null,null,"Install Low-Flow Showerhead",null,null,{"$f":"G8*F8","v":0}]
["Hand Held Showerhead",null,null,null,"Install Low- Flow Aerator",null,null,{"$f":"G9*F9","v":0}]
["Install Low- Flow Aerator",null,null,null,"Flip & Swivel Aerator",null,null,{"$f":"G10*F10","v":0}]
["Install Low-Flow Showerhead",null,null,null,null,null,"Total Cost",{"$f":"SUM(H7:H10)","v":0}]
[]
[]
[]
[]
{"$rows_left_out":20}
{"sheet":"Dwelling Unit Lighting","index":5,"n_rows":176,"n_cols":16,"rows_kept":176,"cut":false,"hidden":true,"merged":[]}
[]
[null,null,"Date",null,null,null,null,"Company and Auditor Name",null,null,null,null,null,null,"Total Units by Type","Quantity"]
[null,null,"Site Name",{"$f":"'Step 1 - Project Info'!C3","v":"Winem Apartments"},null,null,null,null,null,null,null,null,null,null,"Efficiency/ Studio",{"$f":"'Core Services - Unit Matrix'!B11","v":0}]
[null,null,"Site Address",{"$f":"CONCATENATE('Step 1 - Project Info'!C4,\" \",'Step 1 - Project Info'!C5,\" \",'Step 1 - Project Info'!C7)","v":"31 Field St. Ashford"},null,null,null,"Apartment Number",null,null,null,null,null,null,"1 Bedrooms",{"$f":"'Core Services - Unit Matrix'!B12","v":0}]
[null,null,"Building Number",null,null,null,null,"# of Bedrooms",null,null,null,null,null,null,"2 Bedrooms",{"$f":"'Core Services - Unit Matrix'!B13","v":0}]
[null,null,"See notes below",null,null,null,null,null,null,null,null,null,null,null,"3 Bedrooms",{"$f":"'Core Services - Unit Matrix'!B14","v":0}]
[null,null,null,null,null,null,null,null,null,null,null,null,null,null,"4 Bedrooms",{"$f":"'Core Services - Unit Matrix'!B15","v":0}]
[null,null,"Sample Unit #","Room Location","Existing Lamp Type","Existing Lamp Wattage","Existing Lamp Quantity","Existing Fixture Type","Existing Fixture Quantity","Existing Fixture Wattage","Proposed Lighting Measure","Proposed Fixture Type","Proposed Fixture Quantity","Proposed Fixture Wattage","Recommendation (Brand/Model Number):","Comments/Notes:"]
[null,null,null,"Unit type and Unit number"]
[null,"Example",null,"Example"]
["IF('Core Services - Unit Matrix'!$C$12=\"\",IF('Core Services - Unit Matrix'!$C$13=\"\",IF('Core Services - Unit Matrix'!$C$14=\"\",'Core Services - Unit Matrix'!$C$12\"\")","Example",{"$f":"IF('Core Services - Unit Matrix'!$G$19=\"Dwelling Unit Lighting\",'Core Services - Unit Matrix'!$C$19,\"\")","v":"Unit 101"}]
[null,"Example",{"$f":"IF('Core Services - Unit Matrix'!$G$19=\"Dwelling Unit Lighting\",'Core Services - Unit Matrix'!$C$19,\"\")","v":"Unit 101"},"Bedroom","CFL",13,2,"drum",1,28,"New fixture","drum"]
[null,"Example",{"$f":"IF('Core Services - Unit Matrix'!$G$19=\"Dwelling Unit Lighting\",'Core Services - Unit Matrix'!$C$19,\"\")","v":"Unit 101"},"Hallway","Inc",60,2,"drum",1,120,"New fixture","drum"]
[null,"Example",{"$f":"IF('Core Services - Unit Matrix'!$G$19=\"Dwelling Unit Lighting\",'Core Services - Unit Matrix'!$C$19,\"\")","v":"Unit 101"},"Living Room","CFL",13,2,"drum",1,28,"New fixture","drum"]
[null,"Example",{"$f":"IF('Core Services - Unit Matrix'!$G$19=\"Dwelling Unit Lighting\",'Core Services - Unit Matrix'!$C$19,\"\")","v":"Unit 101"},"Living Room","Inc",60,2,"table lamp",2,120,"Screw-in bulb","table lamp"]
{"$rows_left_out":162}
{"sheet":"Common and Exterior Lighting","index":6,"n_rows":124,"n_cols":15,"rows_kept":124,"cut":false,"hidden":true,"merged":[[1,3,3,10],[1,11,3,12],[1,13,1,14],[2,13,2,14],[3,13,3,14]]}
[]
[null,null,null,{"$f":"'Step 1 - Project Info'!$C$3&\" - \"&'Step 1 - Project Info'!$C$7","v":"Winem Apartments - Ashford"},null,null,null,null,null,null,null,"Company and Auditor Name"]
[]
[]
[]
[]
[null,"Area Description","Qty Before","Description Before","Watts/ Fixture Before","Annual Hours Before","Item Type - Select From Picklist","Lighting Group Type - Select From Picklist ","Qty After","Description After","Watts/ Fixture After","Annual Hours After","Material Cost","Labor Cost","Total Cost/ Group"]
["Example","Exterior Pole Lights",465,"70W High Pressure Sodium",95,4004,"Retrofit fixture","High- Performance Exterior",250,"20W LED Corn Bulb",20,5000,50,50,{"$f":"IF(G8=\"Non-Eligible\",0,(I8*(N8+M8)))","v":25000}]
[null,null,null,null,null,560,"Retrofit fixture","High- Performance Exterior",null,null,null,null,null,null,{"$f":"IF(G9=\"Non-Eligible\",0,(I9*(N9+M9)))","v":0}]
[null,null,null,null,null,null,"Retrofit fixture","High- Performance Exterior",null,null,null,null,null,null,0]
[null,null,null,null,null,null,"Retrofit fixture","High- Performance Exterior",null,null,null,null,null,null,0]
[null,null,null,null,null,null,"Retrofit fixture","High- Performance Exterior",null,null,null,null,null,null,0]
[null,null,null,null,null,null,"Retrofit fixture","High- Performance Exterior",null,null,null,null,null,null,0]
[null,null,null,null,null,null,"Retrofit fixture","High- Performance Exterior",null,null,null,null,null,null,0]
["Example","Exterior Pole Lights",70,"70W High Pressure Sodium",95,4004,"Retrofit fixture","High- Performance Exterior",null,"NA",null,null,null,null,0]
{"$rows_left_out":110}
{"sheet":"Lighting Summary","index":7,"n_rows":42,"n_cols":10,"rows_kept":42,"cut":false,"hidden":true,"merged":[[2,3,4,7],[6,2,8,8]]}
[]
[]
[null,null,null,{"$f":"'Step 1 - Project Info'!$C$3&\" - \"&'Step 1 - Project Info'!$C$7","v":"Winem Apartments - Ashford"}]
[]
[]
[null,null,null,"Note: PLEASE SPECIFY MISCELLANEOUS COST ASSOCIATED WITH LIGHTING INSTALLATION"]
[null,null,"TOTAL LIGHTING QUANTITY THE BUILDING NEEDS TO BE SERVICED"]
[]
[]
[null,"Dwelling Unit"]
[null,"Existing Bulb Name","Existing Bulb Wattage","Recommended Bulb Name/ Model","Proposed Bulb Wattage","Quantity","Location","Material cost","Labor  Cost","Total Cost "]
["Example","Incandescent Bulb",60,"A-Line",10,390,"Bedroom",3,3,{"$f":"(H12+I12)*F12","v":2340}]
["Example","Incandescent Bulb",40,"Globe",8,217,"Bathroom",3,3,{"$f":"(H13+I13)*F13","v":1302}]
["Example","Incandescent Bulb",60,"CFL",13,260,"Closet",3,3,1560]
["Example","Incandescent Bulb",60,"A-Line",10,390,"Living room",3,3,2340]
{"$rows_left_out":28}
{"sheet":"Insulation","index":8,"n_rows":20,"n_cols":11,"rows_kept":20,"cut":false,"hidden":true,"merged":[[19,3,19,4],[17,3,17,4],[18,3,18,4],[16,3,16,4],[2,4,4,9]]}
[]
[]
[null,null,null,null,{"$f":"'Step 1 - Project Info'!$C$3&\" - \"&'Step 1 - Project Info'!$C$7","v":"Winem Apartments - Ashford"}]
[]
[]
[]
[null,null,null,"LOCATION","SQUARE FOOTAGE BEING INSULATED","Existing Insulation Type","Existing Insulation Thickness Inches","Existing Insulation R-value","Proposed Insulation Type","Proposed Insulation Installed R-value","Proposed Project Cost"]
[null,"Attic"]
[null,"Roof line/ Vaulted Ceiling"]
[null,"Foundation wall"]
[null,"Basement Ceiling"]
[null,"Exterior Wall"]
[null,"Crawlspace Wall"]
[null,"Crawlspace Ceiling"]
[null,"Rim Joist"]
{"$rows_left_out":6}
{"sheet":"Window Replacements","index":9,"n_rows":20,"n_cols":14,"rows_kept":20,"cut":false,"hidden":true,"merged":[[1,5,3,10]]}
[]
[null,null,null,null,null,{"$f":"'Step 1 - Project Info'!$C$3&\" - \"&'Step 1 - Project Info'!$C$7","v":"Winem Apartments - Ashford"}]
[]
[]
[]
[]
[null,null,null,"EXISTING WINDOW TYPES","PROPOSED MANUFACTURER AND MODEL NUMBER","CPD NUMBER","WIDTH","LENGTH","QUANTITY"," TOTAL AREA","PROPOSED WINDOW TYPE","PROPOSED WINDOW MATERIAL COST","PROPOSED WINDOW LABOR COST","TOTAL COST"]
[null,"Single Pane",null,"Single Pane",null,null,null,null,null,{"$f":"G8*H8*I8","v":0}]
[null,"Double Pane",null,null,null,null,null,null,null,{"$f":"G9*H9*I9","v":0}]
[null,null,null,null,null,null,null,null,null,{"$f":"G10*H10*I10","v":0}]
[null,null,null,null,null,null,null,null,null,{"$f":"G11*H11*I11","v":0}]
[null,null,null,null,null,null,null,null,null,{"$f":"G12*H12*I12","v":0}]
[null,null,null,null,null,null,null,null,null,0]
[null,null,null,null,null,null,null,null,null,0]
[null,null,null,null,null,null,null,null,null,0]
{"$rows_left_out":6}
{"sheet":"Refrigerator Replacements","index":10,"n_rows":15,"n_cols":12,"rows_kept":15,"cut":false,"hidden":true,"merged":[[1,2,1,11],[2,8,2,11],[2,3,2,7]]}
[]
[null,null,{"$f":"'Step 1 - Project Info'!$C$3&\" - \"&'Step 1 - Project Info'!$C$7","v":"Winem Apartments - Ashford"}]
[null,null,null,"Existing Units",null,null,null,null,"Proposed Units"]
[null,null,"Unit #","Age","Make","Size","Model","KWH","Model","Size"," KWH","Cost"]
[null,"Example","A101","15 yrs","Hotpoint",14,"CTH14CYBRLWW",499,"FFHT1513LW",15,355,574]
[]
[]
[]
[]
[null,null," "," "," "," "," "," "," "," "," "," "]
[null,null,null,null,null,null,null,{"$f":"SUM(H5:H9)","v":499},null,null,{"$f":"SUM(K5:K9)","v":355},{"$f":"SUM(L5:L9)","v":574}]
[]
[null,null,null,null,null,null,"∆kWh = ",{"$f":"H11-K11","v":144}]
[null,null,null,null,null,null,"Est. Savings = "]
[null,null,null,null,null,null,"Est. Payback = "]
{"$rows_left_out":1}
{"sheet":"HVAC","index":11,"n_rows":72,"n_cols":15,"rows_kept":72,"cut":false,"hidden":true,"merged":[[68,5,68,9],[47,7,48,10],[59,7,60,10],[16,3,17,4],[18,3,18,4],[67,3,68,4],[29,3,30,4],[31,3,31,4],[55,3,56,4],[57,3,57,4],[1,5,3,12],[8,7,9,10],[20,7,21,10],[34,7,35,10],[67,5,67,9]]}
[]
[null,null,null,null,null,{"$f":"'Step 1 - Project Info'!$C$3&\" - \"&'Step 1 - Project Info'!$C$7","v":"Winem Apartments - Ashford"}]
[]
[]
[]
[]
[]
[]
[null,null,null,null,null,null,null,"HEATING SYSTEM"]
[]
[null,null,null,"LOCATION","EXISTING HEATING SYSTEM TYPE","MODEL NUMBER","AGE","EXISTING SIZE (INPUT MBTU)","Individual or Central System","Quantity","PROPOSED HEATING TYPE","SIZE (INPUT MBTU)","PROPOSED EFFICIENCY (AFUE or HSPF)","Quantity","PROJECT COST"]
[null,"Electric Heater"]
[null,"Gas Boiler"]
[null,"Condensing Gas Boiler"]
[null,"Oil Boiler"]
{"$rows_left_out":58}
{"sheet":"Drop Down List","index":12,"n_rows":22,"n_cols":6,"rows_kept":22,"cut":false,"hidden":true,"merged":[]}
["recessed","recessed"]
["drum","drum","New fixture",null,null,"High- Performance Exterior"]
["wrap","wrap","Retrofit fixture",null,null,"High- Performance Exterior"]
["troffer","troffer","Screw-in bulb",null,null,"Standard Interior"]
["sconce","sconce","Ineligible",null,null,"Standard Exterior"]
["jelly jar","jelly jar","No recommendation"]
["square","square"]
["cloud","cloud"]
["strip","strip"]
["vanity","vanity"]
["table lamp","table lamp"]
["floor lamp","floor lamp"]
["keyless","keyless"]
["plate","wallpack"]
["other","bollard"]
{"$rows_left_out":8}
{"sheet":"Custom Measure","index":13,"n_rows":9,"n_cols":13,"rows_kept":9,"cut":false,"hidden":true,"merged":[[6,5,7,8],[1,2,2,8]]}
[]
[null,null,{"$f":"'Step 1 - Project Info'!$C$3&\" - \"&'Step 1 - Project Info'!$C$7","v":"Winem Apartments - Ashford"}]
[]
[]
[]
[]
[null,null,null,null,null,"Custom Measure Details"]
[]
[null,"LOCATION","EXISTING MEASURE","MODEL NUMBER","AGE","ADDITIONAL DETAIL ON EXISTING MEASURE","ADDITIONAL DETAIL ON EXISTING MEASURE","Existing Measure Quantity","PROPOSED MEASURE","ADDITIONAL DETAIL ON EXISTING MEASURE","ADDITIONAL DETAIL ON EXISTING MEASURE","Proposed Measure Quantity","PROJECT COST"]

{"sheet":"Building Oil or Propane Usage","index":14,"n_rows":30,"n_cols":10,"rows_kept":30,"cut":false,"hidden":true,"merged":[[1,6,2,12]]}
[]
[null,null,null,null,null,null,{"$f":"'Step 1 - Project Info'!$C$3&\"-\"&'Step 1 - Project Info'!$C$7","v":"Winem Apartments-Ashford"}]
[]
[]
[]
[null,null,"Example",null,"Oil Usage Gallons",null,null,"Example",null,"Propane Usage Gallons"]
[null,null,"2013-01-15","2013-02-15",1500,null,null,"2013-01-15","2013-02-15",1500]
[null,null,"2013-02-15","2013-03-15",1000,null,null,"2013-02-15","2013-03-15",1000]
[null,null,"2013-03-15","2013-04-15",600,null,null,"2013-03-15","2013-04-15",600]
[null,null,"2013-04-15","2013-05-15",300,null,null,"2013-04-15","2013-05-15",300]
[null,null,"2013-05-15","2013-06-15",300,null,null,"2013-05-15","2013-06-15",300]
[null,null,"2013-06-15","2013-07-15",300,null,null,"2013-06-15","2013-07-15",300]
[null,null,"2013-07-15","2013-08-15",300,null,null,"2013-07-15","2013-08-15",300]
[null,null,"2013-08-15","2013-09-15",300,null,null,"2013-08-15","2013-09-15",300]
[null,null,"2013-09-15","2013-10-15",300,null,null,"2013-09-15","2013-10-15",300]
{"$rows_left_out":16}
{"sheet":"Dropdown","index":15,"n_rows":163,"n_cols":10,"rows_kept":163,"cut":false,"hidden":true,"merged":[]}
[]
[]
[null,"Competitive Resources, Inc., 60 Church Street, Suite #2, Yalesville, CT 06492",null,"Andover","Carl Watts","Multifamily Low-Rise Apartments 1-3 stories","Air Sealing","None","Electric","Central AC"]
[null,"Energy Efficiencies Solutions, LLC, 398 Palisado Avenue, Windsor, CT 06095",null,"Ansonia","Dana Forrester","Multifamily Mid-Rise Apartments 4 - 5 stories","Duct Sealing","ALM ducts","Nat. Gas","Window AC"]
[null,"Handyman Express Energy Solutions, LLC, 1414 Barnum Avenue,Stratford, CT 06614",null,"Ashford","Sheldon Scott","Multifamily High-Rise Apartments 6 stories or more","Water Measures","ALM ducts and pipes","Prop. Gas","None"]
[null,"New England Smart Energy Group, LLC, 34 Sherman Court, Fairfield, CT 06824",null,"Avon","Natalia Sudyka","Multifamily Apartments","Dwelling Unit Lighting","ALM Pipes","Oil","Other"]
[null,"Santa Fuel, Inc., 154 Admiral Street, Bridgeport, CT 06605",null,"Barkhamsted","Enoch Lenge","Multifamily Townhouse","Common and Exterior Lighting","CO","Other"]
[null,"Action for Bridgeport Community Development, 1070 Park Avenue, Bridegeport, CT 06604",null,"Beacon Falls","Sheldon Scott","Multifamily Other","Insulation","Customer refused"]
[null,"The Access Agency, 1315 Main Street, Willimantic, CT 06226",null,"Berlin","Evan Seretan",null,"Window Replacements","Failed CAZ"]
[null,"Community Renewal Team, Inc., 555 Windsor Street, Hartford, CT 06120",null,"Bethany","Elizabeth Murphy",null,"Refrigerators Replacement","Failed wores case spillage"]
[null,"New Opportunities, Inc.",null,"Bethel",null,null,"HVAC","Gas leak customer side"]
[null,"Energy Resources Group Technologies, Inc.",null,"Bethlehem",null,null,"Custom Measure","Gas Leak Utility side"]
[null,"New Opportunities, Inc., 232 North Elm Street, Waterbury, CT 06702",null,"Bloomfield",null,null,null,"Gas leaks both sides"]
[null,null,null,"Bolton",null,null,null,"Lead"]
[null,"EVERSOURCE GAS",null,"Bozrah",null,null,null,"Mold"]
{"$rows_left_out":148}