{"text_format":"1","workbook":"xlsx","n_sheets":8,"sheets":["tbl","Table of Contents","Introduction","Data Entry","Report","SCR","SNCR","HPWI"],"not_rendered":{"charts":0,"images":1,"macros":1,"external_links":0,"defined_names":10,"comments":0,"pivot_tables":0},"unopened":[],"bounds":{"document_bytes":16777216,"sheet_cells":100000,"rows_first":2000,"rows_last":500,"rows_between":2000,"halvings":0,"cell_chars":16384,"cell_head_chars":4096},"cells_cut":0,"cells_raw":0,"read":"whole","date_system":"1900"}

{"sheet":"tbl","index":0,"n_rows":70,"n_cols":16,"rows_kept":70,"cut":false,"hidden":true,"merged":[[62,4,63,15],[38,3,38,14],[40,5,40,7],[40,8,40,10],[40,15,41,15],[4,3,5,3],[4,4,5,4],[4,5,4,6],[60,4,61,15],[40,11,40,12],[13,6,13,7],[24,3,24,5],[36,3,36,15],[25,3,26,3],[25,4,26,4],[13,3,15,3],[13,4,15,4]]}
[]
[]
[]
[null,null,null,"Molecular Weight of Various Reagents and NO₂"]
[null,null,null,"No.","Component","Molecular Weight"]
[null,null,null,null,null,"Symbol","lb/mole"]
[null,null,null,1,2,3,4]
[null,null,null,1,"ammonia","MNH3",17.03]
[null,null,null,{"$f":"1+D8","v":2},"urea","Murea",60.06]
[null,null,null,{"$f":"1+D9","v":3},"NO₂","MNO2",46.01]
[]
[]
[null,null,null,"Various Reagent Aqueous Solutions and Water Selected Properties"]
[null,null,null,"No.","Component","Concentration","Density",null,"Heat of Vap"]
[null,null,null,null,null,"c","ρ","ρ","Hv"]
[null,null,null,null,null,"% by weight","lb/ft³","lb/gal","Btu/lb"]
[null,null,null,1,{"$f":"1+D17","v":2},{"$f":"1+E17","v":3},{"$f":"1+F17","v":4},{"$f":"1+G17","v":5},{"$f":"1+H17","v":6}]
[null,null,null,1,"ammonia 29%",29,56]
[null,null,null,{"$f":"1+D18","v":2},"urea 50%",50,71]
[null,null,null,{"$f":"1+D19","v":3},"urea 10%",10,null,null,900]
{"$rows_left_out":51}
{"sheet":"Table of Contents","index":1,"n_rows":27,"n_cols":15,"rows_kept":27,"cut":false,"hidden":false,"merged":[[30,6,30,13],[4,4,6,14],[8,14,8,15],[17,6,17,13],[20,6,20,13],[21,6,21,13],[24,6,24,13],[18,6,18,13],[22,6,22,13],[19,6,19,13],[26,4,28,15]]}
[]
[]
[]
[]
[null,null,null,null,"AIR POLLUTION CONTROL\nCOST EFFECTIVENESS ASSESSMENT FOR USE WITH \nRCSA SECTION 22a-174-22e(h)"]
[]
[]
[null,null,null,null,null,null,null,null,null,null,null,null,null,"Revision:","01"]
[null,null,null,null,null,null,null,null,null,null,null,null,null,"Rev. Date:","2016-08-31"]
[]
[]
[]
[null,null,null,null,"TABLE OF CONTENTS"]
[]
[]
[null,null,null,null,"SECTION",null,null,null,null,null,null,null,null,null,"Page"]
[]
[null,null,null,null,1,null,"INTRODUCTION",null,null,null,null,null,null,null,1]
[null,null,null,null,2,null,"DATA ENTRY",null,null,null,null,null,null,null,2]
[null,null,null,null,3,null,"REPORT",null,null,null,null,null,null,null,3]
{"$rows_left_out":8}
{"sheet":"Introduction","index":2,"n_rows":87,"n_cols":19,"rows_kept":87,"cut":false,"hidden":false,"merged":[[38,6,38,19],[36,6,37,18],[15,5,22,18],[6,9,8,17],[24,5,24,18],[26,5,26,18],[10,18,10,19],[39,6,41,18],[46,6,48,19],[69,6,70,19],[71,6,72,19],[73,6,73,19],[79,5,82,19],[74,6,75,19],[49,6,51,19],[52,6,53,19],[55,6,56,19],[54,6,54,19],[63,6,65,19]]}
[]
[]
[]
[]
[]
[]
[null,null,null,null,null,null,null,null,null,"AIR POLLUTION CONTROL\nCOST EFFECTIVENESS ASSESSMENT FOR USE WITH \nRCSA SECTION 22a-174-22e(h)"]
[]
[]
[null,null,null,null,null,null,null,null,null,null,null,null,null,null,null,null,null,"Revision:","02"]
[null,null,null,null,null,null,null,null,null,null,null,null,null,null,null,null,null,"Rev. date:","2016-08-31"]
[]
[]
[]
[]
[null,null,null,null,null,"This template provides a method acceptable to the Commissioner for calculating the cost effectiveness of certain NOx control equipment to support a request for a case-by-case RACT determination pursuant to RCSA section 22a-174-22e(h).  NOx controls addressed in this template include selective catalytic reduction (SCR), selective non-catalytic reduction (SNCR) and high-pressure water injection (HPWI).  The cost per ton of NOx reduced value obtained from this calculator is presumptively acceptable by the commissioner. An owner may use an alternative method to estimate the cost ($/ton of NOx removed) of the post-combustion NOx controls addressed in this template, if the owner justifies such an alternative approach to the commissioner. For control scenarios not addressed in this template, an owner or operator may use any generally accepted method recognized by the U.S. Environmental Protection Agency (EPA) or by an industrial association and must document the method used to the Commissioner's satisfaction."]
[]
[]
[]
[]
{"$rows_left_out":68}
{"sheet":"Data Entry","index":3,"n_rows":161,"n_cols":27,"rows_kept":161,"cut":false,"hidden":false,"merged":[[156,19,158,26],[152,19,153,26],[113,7,114,10],[125,19,127,26],[136,19,137,26],[118,19,119,26],[116,7,117,10],[122,15,123,26],[129,19,130,26],[133,19,134,26],[142,19,143,26],[145,19,146,26],[107,15,108,15],[107,17,108,17],[99,19,100,26],[113,19,114,26],[103,19,104,26],[110,19,111,26],[101,19,102,26],[55,15,55,17],[48,7,49,10],[51,7,52,10],[95,19,96,26],[97,19,98,26],[74,19,75,26],[77,19,78,26],[69,15,70,26],[83,19,85,26],[87,19,91,26],[33,19,35,26],[48,19,48,26],[8,11,9,22],[40,19,42,26],[37,19,37,26],[10,23,10,25],[11,23,11,25],[13,19,15,26],[18,15,19,26],[45,19,47,26],[10,13,11,20],[160,19,162,26],[57,15,59,26],[13,3,15,3],[13,13,15,13],[13,15,15,17],[21,15,21,17],[23,15,23,17],[24,15,24,17],[31,15,31,17],[25,15,25,17],[13,12,15,12],[13,5,15,10],[79,7,80,10],[31,19,32,26],[51,19,52,26],[28,19,29,26]]}
[]
[]
[]
[]
[null,null,null,null,null,null,null,null,null,null,null,null,null,null,null,null,null,null,null,null,null,null,null,null,null,"Revision:","02"]
[null,null,null,null,null,null,null,null,null,null,null,null,null,null,null,null,null,null,null,null,null,null,null,null,null,"Rev. Date:","2016-08-31"]
[]
[]
[null,null,null,null,null,null,null,null,null,null,null,"AIR POLLUTION CONTROLS COST EFFECTIVENESS ASSESSMENT \nFOR USE WITH RCSA SECTION 22a-174-22e(h)"]
[]
[null,null,null,null,null,null,null,null,null,null,"DATA ENTRY"]
[]
[]
[null,null,null,"Line",null,"Item Description",null,null,null,null,null,null,"Symbol","Units",null,"Input",null,null,null,"Comments"]
[]
[]
[]
[null,null,null,null,"I.","Data Required"]
[null,null,null,null,null,null,null,null,null,null,null,null,null,null,null,"Note: If an entry is not applicable to the emission unit, leave the entry field blank. All fields marked with an asterisk \n           are required."]
[]
{"$rows_left_out":142}
{"sheet":"Report","index":4,"n_rows":67,"n_cols":26,"rows_kept":67,"cut":false,"hidden":false,"merged":[[66,9,66,11],[61,12,62,12],[65,12,66,12],[61,13,62,13],[65,13,66,13],[50,9,50,11],[51,9,51,11],[55,9,55,11],[56,9,56,11],[64,15,64,17],[62,9,62,11],[64,19,64,21],[64,23,64,25],[29,15,29,17],[29,19,29,21],[29,23,29,25],[60,15,60,17],[30,15,31,15],[30,17,31,17],[30,25,31,25],[30,23,31,23],[30,21,31,21],[30,19,31,19],[60,19,60,21],[60,23,60,25],[4,23,4,24],[5,23,5,24],[10,23,10,24],[12,19,13,26],[16,15,16,17],[8,10,9,23],[25,19,26,26],[10,14,10,16],[12,3,13,3],[12,5,13,10],[12,12,13,12],[12,13,13,13],[12,15,13,17],[24,15,24,17],[24,19,24,26],[18,15,18,17],[19,15,19,17],[20,15,20,17]]}
[]
[]
[]
[]
[null,null,null,null,null,null,null,null,null,null,null,null,null,null,null,null,null,null,null,null,null,null,null,"Revision:",null,"00"]
[null,null,null,null,null,null,null,null,null,null,null,null,null,null,null,null,null,null,null,null,null,null,null,"Rev. Date:",null,"2016-08-31"]
[]
[]
[null,null,null,null,null,null,null,null,null,null,"AIR POLLUTION CONTROLS COST EFFECTIVENESS ASSESSMENT \nFOR USE WITH RCSA SECTION 22a-174-22e(h)"]
[]
[null,null,null,null,null,null,null,null,null,null,null,null,null,null,"REPORT"]
[]
[null,null,null,null,null,"Item Description",null,null,null,null,null,null,null,null,null,"Input",null,null,null,"Comments"]
[]
[]
[null,null,null,null,null,null,"Emission Unit ID"]
[null,null,null,null,null,null,null,"Owner/Operator",null,null,null,null,null,null,null,{"$f":"+IF('Data Entry'!P22=\"\",\"\",'Data Entry'!P22)","v":""}]
[null,null,null,null,null,null,null,"Owner/Operator Initials",null,null,null,null,null,null,null,{"$f":"+IF('Data Entry'!P23=\"\",\"\",'Data Entry'!P23)","v":""}]
[null,null,null,null,null,null,null,"Facility Name",null,null,null,null,null,null,null,{"$f":"+IF('Data Entry'!P24=\"\",\"\",'Data Entry'!P24)","v":""}]
[null,null,null,null,null,null,null,"Town",null,null,null,null,null,null,null,{"$f":"+IF('Data Entry'!P25=\"\",\"\",'Data Entry'!P25)","v":""}]
{"$rows_left_out":48}
{"sheet":"SCR","index":5,"n_rows":338,"n_cols":27,"rows_kept":338,"cut":false,"hidden":false,"merged":[[325,19,326,26],[203,19,204,26],[205,19,206,26],[207,19,208,26],[210,19,211,26],[251,19,254,26],[285,19,287,26],[215,19,216,26],[218,19,219,26],[266,15,266,19],[267,15,267,26],[19,3,22,3],[103,19,104,26],[115,19,119,26],[160,19,161,26],[57,19,58,26],[112,15,112,17],[80,19,81,26],[59,19,61,26],[68,19,69,26],[71,19,72,26],[125,19,126,26],[25,19,26,26],[172,7,173,10],[172,19,175,26],[152,19,156,26],[121,19,123,26],[163,7,164,10],[142,15,142,17],[130,19,131,26],[133,19,135,26],[142,19,145,26],[163,19,164,26],[11,19,12,26],[8,10,9,15],[116,7,117,10],[46,19,47,26],[19,15,19,17],[21,15,22,15],[21,17,22,17],[15,19,16,26],[19,5,22,10],[19,12,22,12],[19,13,22,13],[19,19,22,26],[80,13,81,13],[37,19,38,26],[83,19,84,26],[87,19,88,26],[331,15,331,17],[335,15,335,17],[336,19,337,26],[272,19,273,26],[332,19,333,26],[275,19,277,26],[304,19,305,26],[294,19,296,26],[289,19,292,26],[320,19,321,26],[300,19,302,26],[307,19,308,26],[309,19,310,26],[312,19,314,26],[323,19,324,26],[279,19,281,26],[13,19,14,26],[42,19,44,26],[49,19,50,26],[55,19,56,26],[264,15,264,17],[185,19,186,26],[147,19,151,26],[128,19,129,26],[167,19,168,26],[179,19,180,26],[188,19,189,26],[199,19,200,26],[201,19,202,26],[196,19,197,26],[182,19,183,26],[29,19,31,26]]}
[]
[]
[]
[]
[null,null,null,null,null,null,null,null,null,null,null,null,null,null,null,null,null,null,null,null,null,null,null,null,null,"Revision:","02"]
[null,null,null,null,null,null,null,null,null,null,null,null,null,null,null,null,null,null,null,null,null,null,null,null,null,"Rev. Date:","2016-08-31"]
[]
[]
[null,null,null,null,null,null,null,null,null,null,"AIR POLLUTION CONTROL COST EFFECTIVENESS ASSESSMENT \nFOR USE WITH RCSA SECTION 22a-174-22e(h)"]
[]
[]
[null,null,null,null,null,null,null,null,null,null,null,null,null,null,null,null,null,"References:",1,"EPA Air Pollution Control Cost Manual - Seventh Edition, Section 4 - NOx Controls: \nChapter 2 - Selective Catalytic Reduction, May 2016."]
[]
[null,null,null,null,null,null,null,null,null,null,"SELECTIVE CATALYTIC REDUCTION - SCR",null,null,null,null,null,null,null,{"$f":"1+S12","v":2},"EPA Air Pollution Control Cost Manual - Sixth Edition (EPA 452/B-02-001), January 2002."]
[]
[null,null,null,null,null,null,null,null,null,null,null,null,null,null,null,null,null,null,{"$f":"1+S14","v":3},"Alternative Control Techniques Document - NOx Emissions from Stationary Gas Turbines - EPA ACT Document No.:  EPA-453/R-93-007."]
[]
[null,null,null,null,null,null,null,null,null,null,null,null,null,null,null,null,null,null,{"$f":"1+S16","v":4},"U.S Department of Labor - Bureau of Labor Statistics: CPI Inflation Calculator."]
[]
[null,null,null,"Line",null,"Item Description",null,null,null,null,null,null,"Symbol","Units",null,"Input",null,null,null,"Comments"]
{"$rows_left_out":319}
{"sheet":"SNCR","index":6,"n_rows":287,"n_cols":27,"rows_kept":287,"cut":false,"hidden":false,"merged":[[149,7,150,10],[240,19,242,26],[158,19,159,26],[140,19,142,26],[161,19,163,26],[221,15,221,17],[177,19,179,26],[173,19,175,26],[185,19,186,26],[216,19,218,26],[181,19,183,26],[202,19,203,26],[205,19,206,26],[194,19,196,26],[198,19,199,26],[223,15,223,19],[101,19,102,26],[245,19,247,26],[274,19,275,26],[19,3,22,3],[85,15,85,17],[53,19,54,26],[67,19,69,26],[57,19,59,26],[65,19,66,26],[21,15,22,15],[21,17,22,17],[42,19,44,26],[37,19,40,26],[63,19,64,26],[76,19,77,26],[92,7,93,10],[281,15,281,17],[285,15,285,17],[120,15,120,17],[257,19,258,26],[282,19,283,26],[249,19,250,26],[264,19,265,26],[188,19,189,26],[191,19,192,26],[230,19,231,26],[236,19,238,26],[271,19,272,26],[233,19,234,26],[120,19,123,26],[132,19,136,26],[252,19,255,26],[15,19,16,26],[8,10,9,15],[11,19,12,26],[19,5,22,10],[19,12,22,12],[19,13,22,13],[13,19,14,26],[48,19,49,26],[19,15,19,17],[19,19,22,26],[87,19,88,26],[29,19,31,26],[25,19,26,26],[224,15,225,26],[227,19,228,26],[9,19,10,26],[113,19,115,26],[97,19,99,26],[209,19,211,26],[145,19,147,26],[149,19,150,26],[155,19,156,26],[109,19,111,26],[125,19,130,26],[165,19,166,26],[168,19,169,26],[106,19,107,26],[117,19,118,26],[91,19,95,26]]}
[]
[]
[]
[]
[null,null,null,null,null,null,null,null,null,null,null,null,null,null,null,null,null,null,null,null,null,null,null,null,null,"Revision:","02"]
[null,null,null,null,null,null,null,null,null,null,null,null,null,null,null,null,null,null,null,null,null,null,null,null,null,"Rev. Date:","2016-08-31"]
[]
[]
[null,null,null,null,null,null,null,null,null,null,"AIR POLLUTION CONTROL COST EFFECTIVENESS ASSESSMENT \nFOR USE WITH RCSA SECTION 22a-174-22e(h)"]
[null,null,null,null,null,null,null,null,null,null,null,null,null,null,null,null,null,"References:",1,"EPA Air Pollution Control Cost Manual - Seventh Edition, Section 4 - NOx Controls: \nChapter 1 - Selective Noncatalytic Reduction, May 2016."]
[]
[null,null,null,null,null,null,null,null,null,null,null,null,null,null,null,null,null,null,{"$f":"1+S10","v":2},"EPA Air Pollution Control Cost Manual - Seventh Edition, Section 4 - NOx Controls: \nChapter 2 - Selective Catalytic Reduction, May 2016."]
[]
[null,null,null,null,null,null,null,null,null,null,"SELECTIVE NONCATALYTIC REDUCTION - SNCR",null,null,null,null,null,null,null,{"$f":"1+S12","v":3},"EPA Air Pollution Control Cost Manual - Sixth Edition (EPA 452/B-02-001), January 2002."]
[]
[null,null,null,null,null,null,null,null,null,null,null,null,null,null,null,null,null,null,{"$f":"1+S14","v":4},"Alternative Control Techniques Document - NOx Emissions from Stationary Gas Turbines - EPA ACT Document No.:  EPA-453/R-93-007."]
[]
[null,null,null,null,null,null,null,null,null,null,null,null,null,null,null,null,null,null,{"$f":"1+S16","v":5},"U.S Department of Labor - Bureau of Labor Statistics: CPI Inflation Calculator."]
[]
[null,null,null,"Line",null,"Item Description",null,null,null,null,null,null,"Symbol","Units",null,"Input",null,null,null,"Comments"]
{"$rows_left_out":268}
{"sheet":"HPWI","index":7,"n_rows":234,"n_cols":27,"rows_kept":234,"cut":false,"hidden":false,"merged":[[131,19,132,26],[123,19,124,26],[8,10,9,15],[9,19,10,26],[11,19,12,26],[19,5,22,10],[19,12,22,12],[19,13,22,13],[19,15,19,17],[15,19,16,26],[19,19,22,26],[13,19,14,26],[29,19,31,26],[25,19,26,26],[232,15,232,17],[214,19,215,26],[217,19,218,26],[196,19,199,26],[126,19,129,26],[176,15,176,17],[165,19,166,26],[179,19,180,26],[151,19,152,26],[154,19,155,26],[182,19,183,26],[193,19,194,26],[229,19,230,26],[134,19,136,26],[204,19,209,26],[159,19,160,26],[19,3,22,3],[228,15,228,17],[101,15,101,17],[88,19,88,26],[77,15,77,17],[80,19,83,26],[21,15,22,15],[21,17,22,17],[46,19,48,26],[37,19,38,26],[40,19,42,26],[140,19,141,26],[143,19,144,26],[146,19,147,26],[81,7,82,10],[120,19,121,26],[162,19,163,26],[189,19,191,26],[186,19,187,26],[201,19,202,26],[51,19,53,26],[55,19,56,26],[58,19,59,26],[61,19,62,26],[64,19,65,26],[96,19,97,26],[98,19,99,26],[93,19,95,26],[106,19,108,26],[85,19,86,26],[111,19,112,26],[114,19,115,26]]}
[]
[]
[]
[]
[null,null,null,null,null,null,null,null,null,null,null,null,null,null,null,null,null,null,null,null,null,null,null,null,null,"Revision:","02"]
[null,null,null,null,null,null,null,null,null,null,null,null,null,null,null,null,null,null,null,null,null,null,null,null,null,"Rev. Date:","2016-08-31"]
[]
[]
[null,null,null,null,null,null,null,null,null,null,"AIR POLLUTION CONTROL COST EFFECTIVENESS ASSESSMENT \nFOR USE WITH RCSA SECTION 22a-174-22e(h)"]
[null,null,null,null,null,null,null,null,null,null,null,null,null,null,null,null,null,"References:",1,"EPA Air Pollution Control Cost Manual - Seventh Edition, Section 4 - NOx Controls: \nChapter 1 - Selective Noncatalytic Reduction, May 2016."]
[]
[null,null,null,null,null,null,null,null,null,null,null,null,null,null,null,null,null,null,{"$f":"1+S10","v":2},"EPA Air Pollution Control Cost Manual - Seventh Edition, Section 4 - NOx Controls: \nChapter 2 - Selective Catalytic Reduction, May 2016."]
[]
[null,null,null,null,null,null,null,null,null,null,"HIGH PRESSURE WATER INJECTION",null,null,null,null,null,null,null,{"$f":"1+S12","v":3},"EPA Air Pollution Control Cost Manual - Sixth Edition (EPA 452/B-02-001), January 2002."]
[]
[null,null,null,null,null,null,null,null,null,null,null,null,null,null,null,null,null,null,{"$f":"1+S14","v":4},"Alternative Control Techniques Document - NOx Emissions from Stationary Gas Turbines - EPA ACT Document No.:  EPA-453/R-93-007."]
[]
[null,null,null,null,null,null,null,null,null,null,null,null,null,null,null,null,null,null,{"$f":"1+S16","v":5},"U.S Department of Labor - Bureau of Labor Statistics: CPI Inflation Calculator."]
[]
[null,null,null,"Line",null,"Item Description",null,null,null,null,null,null,"Symbol","Units",null,"Input",null,null,null,"Comments"]
{"$rows_left_out":214}